{"text_format":"1","workbook":"xlsx","n_sheets":15,"sheets":["Menú","Probabilidades","Ej. 3","Ej. 4","Ej. 5","Probabilidad de aprobar","Sorteos","Simulador de sorteos","Sorteo de temas predefinidos","Temario","Listado de temas","Tabla dinámica temas","Organización del estudio","Cronograma","Horario de estudio"],"not_rendered":{"charts":12,"images":22,"macros":1,"external_links":0,"defined_names":0,"comments":6,"pivot_tables":1},"unopened":[],"bounds":{"document_bytes":16777216,"sheet_cells":100000,"rows_first":2000,"rows_last":500,"rows_between":2000,"halvings":0,"cell_chars":16384,"cell_head_chars":4096},"cells_cut":0,"cells_raw":0,"read":"whole","date_system":"1900"}

{"sheet":"Menú","index":0,"n_rows":50,"n_cols":26,"rows_kept":50,"cut":false,"hidden":false,"merged":[[0,0,3,13]]}
["Preparación de la oposición a TCEE"]
[]
[]
[]
[]
[]
[]
[]
{"$rows_left_out":43}
{"sheet":"Probabilidades","index":1,"n_rows":1,"n_cols":2,"rows_kept":1,"cut":false,"hidden":false,"merged":[[0,1,3,8]]}
[null,"Probabilidades"]

{"sheet":"Ej. 3","index":2,"n_rows":104,"n_cols":67,"rows_kept":104,"cut":false,"hidden":false,"merged":[[58,14,103,14],[8,14,53,14],[10,2,10,3],[5,2,5,3],[56,16,56,60],[55,15,55,60],[6,2,6,3],[7,2,7,3],[9,2,9,3],[6,16,6,60],[12,1,12,2],[12,3,12,4],[0,1,0,4],[0,6,0,8],[4,2,4,3],[5,14,5,60],[1,6,2,6],[3,6,4,6],[3,2,3,3]]}
[null,"Posibilidades de que te salga un tema que te sepas dependiendo del número de ellos que te sabes",null,null,null,null,"Simulador de sorteo"]
[null,"Temas parte A",30,"Temas parte B",30,null,"Temas parte A",{"$f":"_xlfn.RANK.EQ(BM9,$BM$9:$BM$53)","v":11},{"$f":"_xlfn.CONCAT(\"3.A.\",H2)","v":"3.A.11"},{"$f":"VLOOKUP(I2,ListadoDeTemas1[[Tema]:[Nombre del tema]],2,FALSE)","v":"Teoría de la producción. Caracterización de la tecnología de la empresa a corto y largo plazo. El conjunto de posibilidades de producción. La función de producción. Rendimientos locales y globales a escala. Elasticidad de sustitución. Producción conjunta. "}]
[null,null,null,null,null,null,null,{"$f":"_xlfn.RANK.EQ(BM10,$BM$9:$BM$53)","v":14},{"$f":"_xlfn.CONCAT(\"3.A.\",H3)","v":"3.A.14"},{"$f":"VLOOKUP(I3,ListadoDeTemas1[[Tema]:[Nombre del tema]],2,FALSE)","v":"Teoría de juegos. Principales conceptos. Aplicaciones, con especial referencia a las subastas."}]
[null,null,"Probabilidad total",null,null,null,"Temas parte B",{"$f":"_xlfn.RANK.EQ(BO9,$BO$9:$BO$53)","v":12},{"$f":"_xlfn.CONCAT(\"3.B.\",H4)","v":"3.B.12"},{"$f":"VLOOKUP(I4,ListadoDeTemas1[[Tema]:[Nombre del tema]],2,FALSE)","v":"Mecanismos de ajuste de la balanza de pagos. Especial referencia al enfoque intertemporal de balanza de pagos. Análisis de sostenibilidad del déficit y de la deuda exterior."}]
[null,null,{"$f":"VLOOKUP($E$2,$P$8:$BJ$54,$C$2+2,FALSE)","v":0.79912764003673076},null,null,null,null,{"$f":"_xlfn.RANK.EQ(BO10,$BO$9:$BO$53)","v":4},{"$f":"_xlfn.CONCAT(\"3.B.\",H5)","v":"3.B.4"},{"$f":"VLOOKUP(I5,ListadoDeTemas1[[Tema]:[Nombre del tema]],2,FALSE)","v":"Análisis del crecimiento de la empresa. Métodos de valoración de empresas. Especial referencia a los procesos de fusión, adquisición y alianzas estratégicas."}]
[null,null,{"$f":"IFERROR(_xlfn.IFS(IFERROR(VLOOKUP($E$2,$P$8:$BI$55,$C$2+2,FALSE)<VLOOKUP($E$2+1,$P$8:$BI$55,$C$2+1,FALSE),1=0),\"Cambiar un tema de la parte A por un tema de la parte B\",VLOOKUP($E$2,$P$8:$BI$55,$C$2+2,FALSE)<VLOOKUP($E$2-1,$P$8:$BI$55,$C$2+3,FALSE),\"Cambiar un tema de la parte B por un tema de la parte A\"),\"\")","v":""},null,null,null,null,null,null,null,null,null,null,null,"Probabilidad total"]
[null,null,"Probabilidad por número de temas",null,null,null,null,null,null,null,null,null,null,null,null,null,"Temas que te sabes parte A"]
[null,null,{"$f":"VLOOKUP($E$2,$P$58:$BJ$104,$C$2+2,FALSE)","v":1.3318794000612179E-2},null,null,null,null,null,null,null,null,null,null,null,null,null,0,1,2,3,4,5,6,7,8,9,10,11,12,13,14,15,16,17,18,19,20,21,22,23,24,25,26,27,28,29,30,31,32,33,34,35,36,37,38,39,40,41,42,43,44,45,null,null,"#A",null,"#B"]
{"$rows_left_out":97}
{"sheet":"Ej. 4","index":3,"n_rows":65,"n_cols":52,"rows_kept":65,"cut":false,"hidden":false,"merged":[[38,14,64,14],[0,1,0,4],[12,1,12,2],[12,3,12,4],[4,14,4,46],[3,2,3,3],[0,6,0,8],[4,2,4,3],[6,2,6,3],[7,2,7,3],[9,2,9,3],[10,2,10,3],[1,6,2,6],[3,6,4,6],[6,14,32,14],[36,16,36,46],[35,14,35,46],[5,2,5,3]]}
[null,"Posibilidades de que te salga un tema que te sepas dependiendo del número de ellos que te sabes",null,null,null,null,"Simulador de sorteo"]
[null,"Temas parte A",19,"Temas parte B",17,null,"Temas parte A",{"$f":"_xlfn.RANK.EQ(AX7,$AX$7:$AX$36)","v":21},{"$f":"_xlfn.CONCAT(\"4.A.\",H2)","v":"4.A.21"},{"$f":"VLOOKUP(I2,ListadoDeTemas1[[Tema]:[Nombre del tema]],2,FALSE)","v":"Análisis de la evolución de la balanza de pagos y de la Posición de Inversión Internacional de España desde la adopción del euro. Posición neta del Banco de España frente al Eurosistema. La sostenibilidad externa."}]
[null,null,null,null,null,null,null,{"$f":"_xlfn.RANK.EQ(AX8,$AX$7:$AX$36)","v":9},{"$f":"_xlfn.CONCAT(\"4.A.\",H3)","v":"4.A.9"},{"$f":"VLOOKUP(I3,ListadoDeTemas1[[Tema]:[Nombre del tema]],2,FALSE)","v":"Análisis de la industria en España. Características y situación actual. Los retos de la industria y la política industrial en España en el contexto de las economías desarrolladas. La estrategia de la UE."}]
[null,null,"Probabilidad total",null,null,null,"Temas parte B",{"$f":"_xlfn.RANK.EQ(AZ7,$AZ$7:$AZ$32)","v":18},{"$f":"_xlfn.CONCAT(\"4.B.\",H4)","v":"4.B.18"},{"$f":"VLOOKUP(I4,ListadoDeTemas1[[Tema]:[Nombre del tema]],2,FALSE)","v":"Fiscalidad internacional. El Impuesto sobre la Renta de no Residentes en España. Convenios de doble imposición, con especial referencia al modelo de la OCDE. El problema de la erosión de bases imponibles y propuestas de solución."}]
[null,null,{"$f":"VLOOKUP($E$2,$P$6:$AU$33,$C$2+2,FALSE)","v":0.77679929266136161},null,null,null,null,{"$f":"_xlfn.RANK.EQ(AZ8,$AZ$7:$AZ$32)","v":14},{"$f":"_xlfn.CONCAT(\"4.B.\",H5)","v":"4.B.14"},{"$f":"VLOOKUP(I5,ListadoDeTemas1[[Tema]:[Nombre del tema]],2,FALSE)","v":"La teoría del federalismo fiscal: la asignación óptima de las funciones entre los distintos niveles de gobierno para alcanzar el bienestar máximo. La financiación de las haciendas territoriales: impuestos, transferencias y deuda."},null,null,null,null,"Probabilidad total"]
[null,null,{"$f":"IFERROR(_xlfn.IFS(IFERROR(VLOOKUP($E$2,$P$6:$AU$35,$C$2+2,FALSE)<VLOOKUP($E$2+1,$P$6:$AU$35,$C$2+1,FALSE),1=0),\"Cambiar un tema de la parte A por un tema de la parte B\",VLOOKUP($E$2,$P$6:$AU$35,$C$2+2,FALSE)<VLOOKUP($E$2-1,$P$6:$AU$35,$C$2+3,FALSE),\"Cambiar un tema de la parte B por un tema de la parte A\"),\"\")","v":""},null,null,null,null,null,null,null,null,null,null,null,null,null,0,1,2,3,4,5,6,7,8,9,10,11,12,13,14,15,16,17,18,19,20,21,22,23,24,25,26,27,28,29,30,null,null,"#A",null,"#B"]
[null,null,"Probabilidad por número de temas",null,null,null,null,null,null,null,null,null,null,null,"Temas que te sabes parte B",0,{"$f":"VLOOKUP($P7,$D$15:$E$41,2,FALSE)*VLOOKUP(Q$6,$B$15:$C$45,2,FALSE)","v":0},{"$f":"VLOOKUP($P7,$D$15:$E$41,2,FALSE)*VLOOKUP(R$6,$B$15:$C$45,2,FALSE)","v":0},0,0,0,0,0,0,0,0,0,0,0,0,0,0,0,0,0,0,0,0,0,0,0,0,0,0,0,0,0,null,1,{"$f":"RAND()","v":0.37528968997110812},1,{"$f":"RAND()","v":0.4690213122460779}]
[null,null,{"$f":"VLOOKUP($E$2,$P$38:$AU$65,$C$2+2,FALSE)","v":2.1577758129482268E-2},null,null,null,null,null,null,null,null,null,null,null,null,1,{"$f":"VLOOKUP($P8,$D$15:$E$41,2,FALSE)*VLOOKUP(Q$6,$B$15:$C$45,2,FALSE)","v":0},5.1282051282051282E-3,1.0079575596816975E-2,1.4854111405835544E-2,1.9451812555260833E-2,2.387267904509284E-2,2.8116710875331567E-2,3.2183908045977018E-2,3.6074270557029178E-2,3.9787798408488062E-2,4.3324491600353669E-2,4.6684350132626E-2,4.986737400530504E-2,5.2873563218390811E-2,5.5702917771883291E-2,5.8355437665782495E-2,6.0831122900088422E-2,6.3129973474801065E-2,6.5251989389920426E-2,6.7197170645446502E-2,6.8965517241379309E-2,7.0557029177718833E-2,7.1971706454465073E-2,7.3209549071618057E-2,7.4270557029177731E-2,7.515473032714412E-2,7.586206896551724E-2,7.6392572944297091E-2,7.6746242263483658E-2,7.6923076923076927E-2,7.6923076923076927E-2,null,2,{"$f":"RAND()","v":0.72928242475066474},2,0.6233434204805528]
{"$rows_left_out":58}
{"sheet":"Ej. 5","index":4,"n_rows":26,"n_cols":11,"rows_kept":26,"cut":false,"hidden":false,"merged":[[19,1,20,6],[0,8,0,9],[1,1,1,2],[1,3,1,4],[0,1,0,6],[1,5,1,6]]}
[null,"Posibilidades de que te salga un tema que te sepas dependiendo del número de ellos que te sabes",null,null,null,null,null,null,"Simulador de sorteo"]
[null,"Parte A",null,"Parte B",null,"Parte C",null,null,"Tema parte A",{"$f":"_xlfn.CONCAT(\"5.A.\",RANDBETWEEN(1,10))","v":"5.A.1"},{"$f":"VLOOKUP(J2,ListadoDeTemas1[[Tema]:[Nombre del tema]],2,FALSE)","v":"Los regímenes de comercio exterior."}]
[null,"Temas que sabes","Posibilidades","Temas que sabes","Posibilidades","Temas que sabes","Posibilidades",null,"Tema parte B",{"$f":"_xlfn.CONCAT(\"5.B.\",RANDBETWEEN(1,6))","v":"5.B.6"},{"$f":"VLOOKUP(J3,ListadoDeTemas1[[Tema]:[Nombre del tema]],2,FALSE)","v":"Datos de panel. Descripción del problema. El modelo de efectos fijos y de efectos aleatorios. Estimación."}]
[null,10,{"$f":"B4/10","v":1},6,{"$f":"D4/6","v":1},15,{"$f":"F4/15","v":1},null,"Tema parte B",{"$f":"_xlfn.CONCAT(\"5.C.\",RANDBETWEEN(1,15))","v":"5.C.11"},{"$f":"VLOOKUP(J4,ListadoDeTemas1[[Tema]:[Nombre del tema]],2,FALSE)","v":"El Gobierno, su Presidente y el Consejo de Ministros. La Ley de Régimen Jurídico del Sector Público. Objeto y ámbito de aplicación. Principios generales. Organización y funcionamiento de la Administración General del Estado. Organización Central. Órganos Superiores y Directivos. Los Ministerios y su estructura interna. La Organización territorial de la Administración General del Estado. Las Delegaciones y Subdelegaciones del Gobierno."}]
[null,9,{"$f":"B5/10","v":0.9},5,{"$f":"D5/6","v":0.83333333333333337},14,{"$f":"F5/15","v":0.93333333333333335}]
[null,8,0.8,4,0.66666666666666663,13,0.8666666666666667]
[null,7,0.7,3,0.5,12,0.8]
[null,6,0.6,2,0.33333333333333331,11,0.73333333333333328]
{"$rows_left_out":19}
{"sheet":"Probabilidad de aprobar","index":5,"n_rows":13,"n_cols":7,"rows_kept":13,"cut":false,"hidden":false,"merged":[[2,6,3,6],[5,6,6,6],[8,6,10,6],[12,1,12,3],[11,1,11,2],[7,1,7,2],[4,1,4,2],[2,5,3,5],[5,5,6,5],[8,5,10,5]]}
[]
[null,null,"Temas que sé",null,null,"% de aprobar el ejercicio por tema estudiado","Eficiencia en el ejercicio"]
[null,"Tercer ejercicio. Parte A",38,null,null,{"$f":"$D$5/SUM($C$3:$C$4)","v":1.2605601469237832E-2},{"$f":"$D$5/SUM($C$3:$C$4)/MAX('Ej. 3'!$Q$59:$BI$105)","v":0.94645216891697803}]
[null,"Tercer ejercicio. Parte B",38]
[null,"Posibilidades de aprobar el Tercer ejercicio",null,{"$f":"VLOOKUP($C$4,'Ej. 3'!$P$8:$BI$55,$C$3+2,FALSE)","v":0.95802571166207529}]
[null,"Cuarto ejercicio. Parte A",26,null,null,{"$f":"$D$8/SUM($C$6:$C$7)","v":1.9940886699507387E-2},{"$f":"$D$8/SUM($C$6:$C$7)/MAX('Ej. 4'!$Q$39:$AU$67)","v":0.92414080183156844}]
[null,"Cuarto ejercicio. Parte B",23]
[null,"Posibilidades de aprobar el Cuarto ejercicio",null,{"$f":"VLOOKUP($C$7,'Ej. 4'!$P$6:'Ej. 4'!$AU$35,$C$6+2,FALSE)","v":0.97710344827586204}]
{"$rows_left_out":6}
{"sheet":"Sorteos","index":6,"n_rows":1,"n_cols":2,"rows_kept":1,"cut":false,"hidden":false,"merged":[[0,1,3,8]]}
[null,"Sorteos"]

{"sheet":"Simulador de sorteos","index":7,"n_rows":17,"n_cols":13,"rows_kept":17,"cut":false,"hidden":false,"merged":[[10,4,10,12],[13,4,13,12],[14,4,14,12],[15,4,15,12],[16,4,16,12],[11,4,11,12],[12,4,12,12],[2,2,2,5],[2,6,2,9],[2,10,2,12],[7,4,7,12],[8,4,8,12],[3,7,4,7],[3,8,4,8],[10,2,13,2],[14,2,16,2],[1,2,1,12],[6,2,9,2],[5,2,5,12],[3,2,4,2],[3,5,4,5],[3,6,4,6],[3,12,4,12],[3,11,4,11],[3,10,4,10],[3,9,4,9],[3,3,4,3],[3,4,4,4],[6,4,6,12],[9,4,9,12]]}
[]
[null,null,"Simulador de sorteos"]
[null,null,"Tercer ejercicio",null,null,null,"Cuarto ejercicio",null,null,null,"Quinto ejercicio"]
[null,null,{"$f":"'Ej. 3'!$I$2","v":"3.A.11"},{"$f":"'Ej. 3'!I3","v":"3.A.14"},{"$f":"'Ej. 3'!I4","v":"3.B.12"},{"$f":"'Ej. 3'!$I$5","v":"3.B.4"},{"$f":"'Ej. 4'!$I$2","v":"4.A.21"},{"$f":"'Ej. 4'!$I$3","v":"4.A.9"},{"$f":"'Ej. 4'!$I$4","v":"4.B.18"},{"$f":"'Ej. 4'!$I$5","v":"4.B.14"},{"$f":"'Ej. 5'!J2","v":"5.A.1"},{"$f":"'Ej. 5'!J3","v":"5.B.6"},{"$f":"'Ej. 5'!J4","v":"5.C.11"}]
[]
[]
[null,null,"Tercer ejercicio",{"$f":"C4","v":"3.A.11"},{"$f":"IF(VLOOKUP(D7,'Listado de temas'!$E$3:$F$179,2,FALSE)=0,\"\",VLOOKUP(D7,'Listado de temas'!$E$3:$F$179,2,FALSE))","v":"Teoría de la producción. Caracterización de la tecnología de la empresa a corto y largo plazo. El conjunto de posibilidades de producción. La función de producción. Rendimientos locales y globales a escala. Elasticidad de sustitución. Producción conjunta. "}]
[null,null,null,{"$f":"D4","v":"3.A.14"},{"$f":"IF(VLOOKUP(D8,'Listado de temas'!$E$3:$F$179,2,FALSE)=0,\"\",VLOOKUP(D8,'Listado de temas'!$E$3:$F$179,2,FALSE))","v":"Teoría de juegos. Principales conceptos. Aplicaciones, con especial referencia a las subastas."}]
{"$rows_left_out":10}
{"sheet":"Sorteo de temas predefinidos","index":8,"n_rows":95,"n_cols":10,"rows_kept":95,"cut":false,"hidden":false,"merged":[[3,2,3,9],[4,8,4,9],[1,2,1,7]]}
[]
[null,null,"Buscar título del tema: ",null,null,null,null,null,"3.A.25",{"$f":"IF(VLOOKUP(I2,'Listado de temas'!$E$3:$F$179,2,FALSE)=0,\"\",VLOOKUP(I2,'Listado de temas'!$E$3:$F$179,2,FALSE))","v":"La teoría neoclásica del mercado de trabajo. Análisis intertemporal de la oferta de trabajo. Teoría del capital humano. Función de ingresos de capital humano y evidencia empírica."}]
[]
[null,null,"Sorteo de temas predefinidos"]
[null,null,"#",null,"Temas a incluir en el sorteo:",null,null,"Cuántos temas obtener como resultado","RESULTADO"]
[null,null,1,{"$f":"RAND()","v":0.75549963476597404},"3.B.3",0,{"$f":"CELL(\"fila\",G6)-1","v":5},2,{"$f":"VLOOKUP(RANDBETWEEN(1,(VLOOKUP(\"-\",$E$6:$G$95,2,FALSE))),$C$6:$E$95,3,FALSE)","v":"3.A.21"},{"$f":"IF(VLOOKUP(I6,'Listado de temas'!$E$3:$F$179,2,FALSE)=0,\"\",VLOOKUP(I6,'Listado de temas'!$E$3:$F$179,2,FALSE))","v":"La teoría del equilibrio general."}]
[null,null,2,{"$f":"RAND()","v":0.30546328491791075},"3.B.4",1,{"$f":"CELL(\"fila\",G7)-1","v":6},null,"3.A.44",{"$f":"IF(VLOOKUP(I7,'Listado de temas'!$E$3:$F$179,2,FALSE)=0,\"\",VLOOKUP(I7,'Listado de temas'!$E$3:$F$179,2,FALSE))","v":"Crecimiento económico (II). Modelos de crecimiento endógeno: rendimientos crecientes, capital humano e innovación tecnológica."}]
[null,null,3,{"$f":"RAND()","v":0.26563147559375078},"3.B.6",2,{"$f":"CELL(\"fila\",G8)-1","v":7},null,"3.A.42",{"$f":"IF(VLOOKUP(I8,'Listado de temas'!$E$3:$F$179,2,FALSE)=0,\"\",VLOOKUP(I8,'Listado de temas'!$E$3:$F$179,2,FALSE))","v":"Teorías de los ciclos económicos: ciclos nominales y reales. Referencia al ciclo financiero y sus interrelaciones con el ciclo real."}]
{"$rows_left_out":88}
{"sheet":"Temario","index":9,"n_rows":1,"n_cols":2,"rows_kept":1,"cut":false,"hidden":false,"merged":[[0,1,3,8]]}
[null,"Temario"]

{"sheet":"Listado de temas","index":10,"n_rows":179,"n_cols":8,"rows_kept":179,"cut":false,"hidden":false,"merged":[[0,0,0,7]]}
["Listado de temas"]
[null,"Ejercicio","Parte","Número","Tema","Nombre del tema","Categoría","Bloque"]
[null,3,"A",1,{"$f":"_xlfn.CONCAT(B3,\".\",C3,\".\",D3)","v":"3.A.1"},"Objeto y métodos de la ciencia económica. Cuestiones y debates actuales, con especial referencia a la economía conductual.","Mixto","Pensamiento económico"]
[null,3,"A",2,"3.A.2","Los economistas clásicos y Marx.","Mixto","Pensamiento económico"]
[null,3,"A",3,"3.A.3","Los economistas neoclásicos.","Mixto","Pensamiento económico"]
[null,3,"A",4,"3.A.4","El pensamiento económico de Keynes. Referencia a la economía post-keynesiana y el desequilibrio.","Mixto","Pensamiento económico"]
[null,3,"A",5,"3.A.5","La síntesis neoclásica. El monetarismo.","Mixto","Pensamiento económico"]
[null,3,"A",6,"3.A.6","La nueva macroeconomía clásica. La hipótesis de las expectativas racionales; la crítica de Lucas; el surgimiento de los modelos dinámicos estocásticos de equilibrio general.","Mixto","Pensamiento económico"]
{"$rows_left_out":172}
{"sheet":"Tabla dinámica temas","index":11,"n_rows":29,"n_cols":3,"rows_kept":29,"cut":false,"hidden":false,"merged":[]}
[]
[null,"Ejercicio",3]
[]
[null,"Etiquetas de fila","Cuenta de Nombre del tema"]
[null,"A",45]
[null,"Mixto",7]
[null,"Pensamiento económico",7]
[null,"Microeconomía",17]
{"$rows_left_out":22}
{"sheet":"Organización del estudio","index":12,"n_rows":1,"n_cols":2,"rows_kept":1,"cut":false,"hidden":false,"merged":[[0,1,3,8]]}
[null,"Organización del estudio"]

{"sheet":"Cronograma","index":13,"n_rows":179,"n_cols":9,"rows_kept":179,"cut":false,"hidden":false,"merged":[]}
[null,null,"Semana","Día (opc.)","Tema","Nombre del tema","Categoría","Bloque","Comentario"]
[null,null,1,"Lunes","3.A.8",{"$f":"IFERROR(VLOOKUP('Cronograma'!$E2,ListadoDeTemas1[[Tema]:[Bloque]],COLUMNS('Cronograma'!$E2:F2),FALSE),\"\")","v":"Teoría de la demanda del consumidor (I). Axiomas sobre las preferencias, función de utilidad y función de demanda marshalliana. La teoría de la preferencia revelada. Precios hedónicos."},{"$f":"IFERROR(VLOOKUP('Cronograma'!$E2,ListadoDeTemas1[[Tema]:[Bloque]],COLUMNS('Cronograma'!$E2:G2),FALSE),\"\")","v":"Microeconomía"},{"$f":"IFERROR(VLOOKUP('Cronograma'!$E2,ListadoDeTemas1[[Tema]:[Bloque]],COLUMNS('Cronograma'!$E2:H2),FALSE),\"\")","v":"Modelo neoclásico básico"}]
[null,null,null,null,"3.A.10",{"$f":"IFERROR(VLOOKUP('Cronograma'!$E3,ListadoDeTemas1[[Tema]:[Bloque]],COLUMNS('Cronograma'!$E3:F3),FALSE),\"\")","v":"Teoría de la demanda del consumidor (III). Elección del consumidor en situaciones de riesgo e incertidumbre."},{"$f":"IFERROR(VLOOKUP('Cronograma'!$E3,ListadoDeTemas1[[Tema]:[Bloque]],COLUMNS('Cronograma'!$E3:G3),FALSE),\"\")","v":"Microeconomía"},{"$f":"IFERROR(VLOOKUP('Cronograma'!$E3,ListadoDeTemas1[[Tema]:[Bloque]],COLUMNS('Cronograma'!$E3:H3),FALSE),\"\")","v":"Información y poder de mercado"}]
[null,null,null,null,null,{"$f":"IFERROR(VLOOKUP('Cronograma'!$E4,ListadoDeTemas1[[Tema]:[Bloque]],COLUMNS('Cronograma'!$E4:F4),FALSE),\"\")","v":""},{"$f":"IFERROR(VLOOKUP('Cronograma'!$E4,ListadoDeTemas1[[Tema]:[Bloque]],COLUMNS('Cronograma'!$E4:G4),FALSE),\"\")","v":""},{"$f":"IFERROR(VLOOKUP('Cronograma'!$E4,ListadoDeTemas1[[Tema]:[Bloque]],COLUMNS('Cronograma'!$E4:H4),FALSE),\"\")","v":""}]
[null,null,null,null,null,{"$f":"IFERROR(VLOOKUP('Cronograma'!$E5,ListadoDeTemas1[[Tema]:[Bloque]],COLUMNS('Cronograma'!$E5:F5),FALSE),\"\")","v":""},{"$f":"IFERROR(VLOOKUP('Cronograma'!$E5,ListadoDeTemas1[[Tema]:[Bloque]],COLUMNS('Cronograma'!$E5:G5),FALSE),\"\")","v":""},{"$f":"IFERROR(VLOOKUP('Cronograma'!$E5,ListadoDeTemas1[[Tema]:[Bloque]],COLUMNS('Cronograma'!$E5:H5),FALSE),\"\")","v":""}]
[null,null,null,null,null,{"$f":"IFERROR(VLOOKUP('Cronograma'!$E6,ListadoDeTemas1[[Tema]:[Bloque]],COLUMNS('Cronograma'!$E6:F6),FALSE),\"\")","v":""},{"$f":"IFERROR(VLOOKUP('Cronograma'!$E6,ListadoDeTemas1[[Tema]:[Bloque]],COLUMNS('Cronograma'!$E6:G6),FALSE),\"\")","v":""},{"$f":"IFERROR(VLOOKUP('Cronograma'!$E6,ListadoDeTemas1[[Tema]:[Bloque]],COLUMNS('Cronograma'!$E6:H6),FALSE),\"\")","v":""}]
[null,null,null,null,null,{"$f":"IFERROR(VLOOKUP('Cronograma'!$E7,ListadoDeTemas1[[Tema]:[Bloque]],COLUMNS('Cronograma'!$E7:F7),FALSE),\"\")","v":""},{"$f":"IFERROR(VLOOKUP('Cronograma'!$E7,ListadoDeTemas1[[Tema]:[Bloque]],COLUMNS('Cronograma'!$E7:G7),FALSE),\"\")","v":""},{"$f":"IFERROR(VLOOKUP('Cronograma'!$E7,ListadoDeTemas1[[Tema]:[Bloque]],COLUMNS('Cronograma'!$E7:H7),FALSE),\"\")","v":""}]
[null,null,null,null,null,{"$f":"IFERROR(VLOOKUP('Cronograma'!$E8,ListadoDeTemas1[[Tema]:[Bloque]],COLUMNS('Cronograma'!$E8:F8),FALSE),\"\")","v":""},{"$f":"IFERROR(VLOOKUP('Cronograma'!$E8,ListadoDeTemas1[[Tema]:[Bloque]],COLUMNS('Cronograma'!$E8:G8),FALSE),\"\")","v":""},{"$f":"IFERROR(VLOOKUP('Cronograma'!$E8,ListadoDeTemas1[[Tema]:[Bloque]],COLUMNS('Cronograma'!$E8:H8),FALSE),\"\")","v":""}]
{"$rows_left_out":172}
{"sheet":"Horario de estudio","index":14,"n_rows":50,"n_cols":13,"rows_kept":50,"cut":false,"hidden":false,"merged":[[1,11,1,12],[10,10,10,13]]}
[]
[null,null,"Hora","Sábado","Domingo","Lunes","Martes","Miércoles","Jueves","Viernes",null,"Estadísticas del horario"]
[null,null,"00:00:00","Dormir","Dormir","Dormir","Dormir","Dormir","Dormir","Dormir",null,"Horas dormir/día",{"$f":"COUNTIF(Horario[[Sábado]:[Viernes]],\"Dormir\")*0.5/7","v":7.8571428571428568}]
[null,null,"00:30:00","Dormir","Dormir","Dormir","Dormir","Dormir","Dormir","Dormir",null,"Horas descanso/día",{"$f":"COUNTIF(Horario[[Sábado]:[Viernes]],\"Descanso\")*0.5/7","v":4.2142857142857144}]
[null,null,"01:00:00","Dormir","Dormir","Dormir","Dormir","Dormir","Dormir","Dormir",null,"Horas ejercicio/día",{"$f":"COUNTIF(Horario[[Sábado]:[Viernes]],\"Ejercicio\")*0.5/7","v":1.2857142857142858}]
[null,null,"01:30:00","Dormir","Dormir","Dormir","Dormir","Dormir","Dormir","Dormir",null,"Horas comer/día",{"$f":"(COUNTIF(Horario[[Sábado]:[Viernes]],\"Desayuno\")+COUNTIF(Horario[[Sábado]:[Viernes]],\"Comida\")+COUNTIF(Horario[[Sábado]:[Viernes]],\"Cena\"))*0.5/7","v":2.9285714285714284}]
[null,null,"02:00:00","Dormir","Dormir","Dormir","Dormir","Dormir","Dormir","Dormir",null,"Horas estudiar/día",{"$f":"COUNTIF(Horario[[Sábado]:[Viernes]],\"Estudiar\")*0.5/7","v":7.4285714285714288}]
[null,null,"02:30:00","Dormir","Dormir","Dormir","Dormir","Dormir","Dormir","Dormir",null,"Horas idioma/día",{"$f":"COUNTIF(Horario[[Sábado]:[Viernes]],\"Idioma\")*0.5/7","v":0.2857142857142857}]
{"$rows_left_out":42}