{"text_format":"1","workbook":"xlsx","n_sheets":15,"sheets":["Menú","Probabilidades","Ej. 3","Ej. 4","Ej. 5","Probabilidad de aprobar","Sorteos","Simulador de sorteos","Sorteo de temas predefinidos","Temario","Listado de temas","Tabla dinámica temas","Organización del estudio","Cronograma","Horario de estudio"],"not_rendered":{"charts":12,"images":22,"macros":1,"external_links":0,"defined_names":0,"comments":6,"pivot_tables":1},"unopened":[],"bounds":{"document_bytes":16777216,"sheet_cells":100000,"rows_first":2000,"rows_last":500,"rows_between":2000,"halvings":0,"cell_chars":16384,"cell_head_chars":4096},"cells_cut":0,"cells_raw":0,"read":"whole","date_system":"1900"}

{"sheet":"Menú","index":0,"n_rows":50,"n_cols":26,"rows_kept":50,"cut":false,"hidden":false,"merged":[[0,0,3,13]]}
["Preparación de la oposición a TCEE"]
[]
[]
[]
[]
[]
[]
[]
[]
[]
[]
[]
[]
[]
[]
[]
[]
[]
[]
[]
[]
[]
[]
[]
[]
[]
[]
[]
[]
[]
[]
[]
[]
[]
[]
[]
[]
[]
[]
[]
[]
[]
[]
[]
[]
[]
[]
[]
[]
[null,null,null,null,null,null,null,null,null,null,null,null,null,null,null,null,null,null,null,null,null,null,null,null,null,"Víctor Gutiérrez Marcos ©"]

{"sheet":"Probabilidades","index":1,"n_rows":1,"n_cols":2,"rows_kept":1,"cut":false,"hidden":false,"merged":[[0,1,3,8]]}
[null,"Probabilidades"]

{"sheet":"Ej. 3","index":2,"n_rows":104,"n_cols":67,"rows_kept":104,"cut":false,"hidden":false,"merged":[[58,14,103,14],[8,14,53,14],[10,2,10,3],[5,2,5,3],[56,16,56,60],[55,15,55,60],[6,2,6,3],[7,2,7,3],[9,2,9,3],[6,16,6,60],[12,1,12,2],[12,3,12,4],[0,1,0,4],[0,6,0,8],[4,2,4,3],[5,14,5,60],[1,6,2,6],[3,6,4,6],[3,2,3,3]]}
[null,"Posibilidades de que te salga un tema que te sepas dependiendo del número de ellos que te sabes",null,null,null,null,"Simulador de sorteo"]
[null,"Temas parte A",30,"Temas parte B",30,null,"Temas parte A",{"$f":"_xlfn.RANK.EQ(BM9,$BM$9:$BM$53)","v":11},{"$f":"_xlfn.CONCAT(\"3.A.\",H2)","v":"3.A.11"},{"$f":"VLOOKUP(I2,ListadoDeTemas1[[Tema]:[Nombre del tema]],2,FALSE)","v":"Teoría de la producción. Caracterización de la tecnología de la empresa a corto y largo plazo. El conjunto de posibilidades de producción. La función de producción. Rendimientos locales y globales a escala. Elasticidad de sustitución. Producción conjunta. "}]
[null,null,null,null,null,null,null,{"$f":"_xlfn.RANK.EQ(BM10,$BM$9:$BM$53)","v":14},{"$f":"_xlfn.CONCAT(\"3.A.\",H3)","v":"3.A.14"},{"$f":"VLOOKUP(I3,ListadoDeTemas1[[Tema]:[Nombre del tema]],2,FALSE)","v":"Teoría de juegos. Principales conceptos. Aplicaciones, con especial referencia a las subastas."}]
[null,null,"Probabilidad total",null,null,null,"Temas parte B",{"$f":"_xlfn.RANK.EQ(BO9,$BO$9:$BO$53)","v":12},{"$f":"_xlfn.CONCAT(\"3.B.\",H4)","v":"3.B.12"},{"$f":"VLOOKUP(I4,ListadoDeTemas1[[Tema]:[Nombre del tema]],2,FALSE)","v":"Mecanismos de ajuste de la balanza de pagos. Especial referencia al enfoque intertemporal de balanza de pagos. Análisis de sostenibilidad del déficit y de la deuda exterior."}]
[null,null,{"$f":"VLOOKUP($E$2,$P$8:$BJ$54,$C$2+2,FALSE)","v":0.79912764003673076},null,null,null,null,{"$f":"_xlfn.RANK.EQ(BO10,$BO$9:$BO$53)","v":4},{"$f":"_xlfn.CONCAT(\"3.B.\",H5)","v":"3.B.4"},{"$f":"VLOOKUP(I5,ListadoDeTemas1[[Tema]:[Nombre del tema]],2,FALSE)","v":"Análisis del crecimiento de la empresa. Métodos de valoración de empresas. Especial referencia a los procesos de fusión, adquisición y alianzas estratégicas."}]
[null,null,{"$f":"IFERROR(_xlfn.IFS(IFERROR(VLOOKUP($E$2,$P$8:$BI$55,$C$2+2,FALSE)<VLOOKUP($E$2+1,$P$8:$BI$55,$C$2+1,FALSE),1=0),\"Cambiar un tema de la parte A por un tema de la parte B\",VLOOKUP($E$2,$P$8:$BI$55,$C$2+2,FALSE)<VLOOKUP($E$2-1,$P$8:$BI$55,$C$2+3,FALSE),\"Cambiar un tema de la parte B por un tema de la parte A\"),\"\")","v":""},null,null,null,null,null,null,null,null,null,null,null,"Probabilidad total"]
[null,null,"Probabilidad por número de temas",null,null,null,null,null,null,null,null,null,null,null,null,null,"Temas que te sabes parte A"]
[null,null,{"$f":"VLOOKUP($E$2,$P$58:$BJ$104,$C$2+2,FALSE)","v":1.3318794000612179E-2},null,null,null,null,null,null,null,null,null,null,null,null,null,0,1,2,3,4,5,6,7,8,9,10,11,12,13,14,15,16,17,18,19,20,21,22,23,24,25,26,27,28,29,30,31,32,33,34,35,36,37,38,39,40,41,42,43,44,45,null,null,"#A",null,"#B"]
[null,null,null,null,null,null,null,null,null,null,null,null,null,null,"Temas que te sabes parte B",0,{"$f":"VLOOKUP($P9,$D$15:$E$60,2,FALSE)*VLOOKUP(Q$8,$B$15:$C$60,2,FALSE)","v":0},{"$f":"VLOOKUP($P9,$D$15:$E$60,2,FALSE)*VLOOKUP(R$8,$B$15:$C$60,2,FALSE)","v":0},0,0,0,0,0,0,0,0,0,0,0,0,0,0,0,0,0,0,0,0,0,0,0,0,0,0,0,0,0,0,0,0,0,0,0,0,0,0,0,0,0,0,0,0,null,1,{"$f":"RAND()","v":0.688074151744405},1,{"$f":"RAND()","v":0.7605232432497363}]
[null,null,"Nivel de eficiencia",null,null,null,null,null,null,null,null,null,null,null,null,1,{"$f":"VLOOKUP($P10,$D$15:$E$60,2,FALSE)*VLOOKUP(Q$8,$B$15:$C$60,2,FALSE)","v":0},1.9753086419753087E-3,3.9057239057239063E-3,5.7912457912457915E-3,7.6318742985409657E-3,9.427609427609427E-3,1.117845117845118E-2,1.2884399551066216E-2,1.4545454545454545E-2,1.6161616161616162E-2,1.7732884399551067E-2,1.9259259259259261E-2,2.074074074074074E-2,2.2177328843995512E-2,2.3569023569023569E-2,2.4915824915824916E-2,2.6217732884399554E-2,2.7474747474747475E-2,2.8686868686868691E-2,2.985409652076319E-2,3.097643097643098E-2,3.2053872053872057E-2,3.3086419753086418E-2,3.4074074074074076E-2,3.5016835016835016E-2,3.5914702581369251E-2,3.6767676767676769E-2,3.7575757575757575E-2,3.8338945005611677E-2,3.9057239057239061E-2,3.9730639730639727E-2,4.0359147025813689E-2,4.0942760942760947E-2,4.148148148148148E-2,4.1975308641975309E-2,4.2424242424242427E-2,4.2828282828282833E-2,4.3187429854096522E-2,4.35016835016835E-2,4.3771043771043773E-2,4.3995510662177328E-2,4.4175084175084173E-2,4.4309764309764313E-2,4.4399551066217742E-2,4.4444444444444446E-2,4.4444444444444446E-2,null,2,{"$f":"RAND()","v":0.66532593393359041},2,{"$f":"RAND()","v":0.91306547945829886}]
[null,null,{"$f":"C8/MAX(Q59:BJ104)","v":1},null,null,null,null,null,null,null,null,null,null,null,null,2,0,3.9057239057239063E-3,7.7226813590449972E-3,1.1450872359963272E-2,1.5090296908478728E-2,1.864095500459137E-2,2.2102846648301196E-2,2.5475971839608206E-2,2.8760330578512398E-2,3.1955922865013781E-2,3.5062748699112342E-2,3.808080808080809E-2,4.1010101010101017E-2,4.3850627486991131E-2,4.6602387511478424E-2,4.9265381083562904E-2,5.1839608203244576E-2,5.4325068870523421E-2,5.672176308539946E-2,5.9029690847872671E-2,6.1248852157943082E-2,6.3379247015610651E-2,6.5420875420875435E-2,6.7373737373737377E-2,6.923783287419652E-2,7.1013161922252849E-2,7.269972451790635E-2,7.4297520661157038E-2,7.5806550352004912E-2,7.7226813590449972E-2,7.8558310376492191E-2,7.9801040710131624E-2,8.0955004591368243E-2,8.2020202020202035E-2,8.2996632996632999E-2,8.3884297520661177E-2,8.4683195592286514E-2,8.5393327211509037E-2,8.6014692378328747E-2,8.6547291092745657E-2,8.6991123354759725E-2,8.7346189164370994E-2,8.7612488521579435E-2,8.7790021426385076E-2,8.787878787878789E-2,8.787878787878789E-2,null,3,0.67889134367371451,3,0.32227258950961102]
[null,null,null,null,null,null,null,null,null,null,null,null,null,null,null,3,0,5.7912457912457915E-3,1.1450872359963272E-2,1.6978879706152434E-2,2.2375267829813285E-2,2.7640036730945821E-2,3.2773186409550049E-2,3.7774716865625953E-2,4.2644628099173555E-2,4.7382920110192843E-2,5.1989592898683809E-2,5.6464646464646467E-2,6.0808080808080811E-2,6.501989592898684E-2,6.9100091827364554E-2,7.3048668503213954E-2,7.6865625956535052E-2,8.0550964187327823E-2,8.4104683195592292E-2,8.7526782981328446E-2,9.0817263544536286E-2,9.3976124885215798E-2,9.7003367003367008E-2,9.989898989898989E-2,0.10266299357208448,0.10529537802265077,0.10779614325068872,0.11016528925619835,0.11240281603917968,0.11450872359963271,0.11648301193755738,0.11832568105295378,0.12003673094582187,0.12161616161616162,0.12306397306397307,0.1243801652892562,0.12556473829201104,0.12661769207223753,0.12753902662993571,0.1283287419651056,0.12898683807774716,0.12951331496786042,0.12990817263544538,0.13017141108050201,0.13030303030303031,0.13030303030303031,null,4,0.9904592773184594,4,4.0497889564850897E-2]
[null,"Parte A",null,"Parte B",null,null,null,null,null,null,null,null,null,null,null,4,0,7.6318742985409657E-3,1.5090296908478728E-2,2.2375267829813285E-2,2.9486787062544637E-2,3.6424854606672781E-2,4.3189470462197732E-2,4.9780634629119476E-2,5.6198347107438013E-2,6.2442607897153349E-2,6.8513416998265478E-2,7.4410774410774413E-2,8.0134680134680128E-2,8.5685134169982649E-2,9.1062136516681963E-2,9.626568717477807E-2,0.101295786144271,0.10615243342516069,0.1108356290174472,0.11534537292113049,0.11968166513621059,0.12384450566268747,0.12783389450056118,0.13164983164983163,0.13529231711049891,0.13876135088256303,0.14205693296602387,0.14517906336088154,0.148127742067136,0.15090296908478729,0.1535047444138353,0.15593306805428017,0.15818794000612182,0.16026936026936026,0.16217732884399549,0.16391184573002754,0.16547291092745639,0.16686052443628202,0.16807468625650443,0.16911539638812365,0.16998265483113967,0.1706764615855525,0.1711968166513621,0.17154372002856852,0.17171717171717171,0.17171717171717171,null,5,0.26691933656889166,5,0.15382189309332406]
[null,"Temas que sabes","Posibilidades","Temas que sabes","Posibilidades",null,null,null,null,null,null,null,null,null,null,5,0,9.427609427609427E-3,1.864095500459137E-2,2.7640036730945821E-2,3.6424854606672781E-2,4.499540863177226E-2,5.3351698806244255E-2,6.1493725130088758E-2,6.9421487603305784E-2,7.7134986225895305E-2,8.4634220997857362E-2,9.1919191919191914E-2,9.8989898989898975E-2,0.10584634220997856,0.11248852157943065,0.11891643709825525,0.1251300887664524,0.13112947658402202,0.13691460055096419,0.14248546066727882,0.14784205693296601,0.15298438934802569,0.15791245791245789,0.16262626262626259,0.16712580348943984,0.17141108050198958,0.17548209366391182,0.17933884297520658,0.18298132843587386,0.1864095500459137,0.18962350780532594,0.19262320171411076,0.19540863177226814,0.19797979797979795,0.20033670033670031,0.2024793388429752,0.20440771349862258,0.20612182430364248,0.20762167125803488,0.2089072543617998,0.20997857361493721,0.21083562901744718,0.21147842056932964,0.21190694827058462,0.2121212121212121,0.2121212121212121,null,6,0.713404323225583,6,0.7696015195986684]
[null,45,{"$f":"(B15/45)+(((45-B15)/45)*(B15/44))","v":1},45,{"$f":"(D15/45)+(((45-D15)/45)*(D15/44))","v":1},null,null,null,null,null,null,null,null,null,null,6,0,{"$f":"VLOOKUP($P15,$D$15:$E$60,2,FALSE)*VLOOKUP(R$8,$B$15:$C$60,2,FALSE)","v":1.117845117845118E-2},2.2102846648301196E-2,3.2773186409550049E-2,4.3189470462197732E-2,5.3351698806244255E-2,6.3259871441689625E-2,7.2913988368533827E-2,8.2314049586776863E-2,9.1460055096418733E-2,0.10035200489745945,0.108989898989899,0.11737373737373738,0.12550352004897461,0.13337924701561066,0.14100091827364553,0.1483685338230793,0.15548209366391186,0.16234159779614327,0.16894704621977349,0.1752984389348026,0.18139577594123049,0.18723905723905726,0.19282828282828282,0.19816345270890726,0.20324456688093054,0.20807162534435261,0.21264462809917356,0.21696357514539333,0.22102846648301197,0.22483930211202935,0.22839608203244566,0.23169880624426081,0.23474747474747476,0.23754208754208755,0.2400826446280992,0.24236914600550968,0.24440159167431896,0.24617998163452709,0.24770431588613409,0.24897459442913988,0.24999081726354452,0.25075298438934801,0.25126109580655037,0.25151515151515152,0.25151515151515152,null,7,0.70467471242487323,7,0.47625268621257644]
[null,44,{"$f":"(B16/45)+(((45-B16)/45)*(B16/44))","v":1},44,1,null,null,null,null,null,null,null,null,null,null,7,0,1.2884399551066216E-2,2.5475971839608206E-2,3.7774716865625953E-2,4.9780634629119476E-2,6.1493725130088758E-2,7.2913988368533827E-2,8.4041424344454635E-2,9.4876033057851236E-2,0.10541781450872359,0.11566676869707172,0.12562289562289561,0.13528619528619529,0.14465666768697069,0.1537343128252219,0.16251913070094887,0.17101112131415161,0.17921028466483011,0.18711662075298438,0.19473012957861441,0.20205081114172024,0.20907866544230178,0.21581369248035914,0.22225589225589223,0.22840526476890111,0.23426181001938579,0.23982552800734616,0.24509641873278235,0.25007448219569428,0.25475971839608202,0.25915212733394544,0.26325170900928474,0.26705846342209977,0.27057239057239058,0.27379349046015711,0.27672176308539942,0.27935720844811757,0.28169982654831138,0.28374961738598098,0.28550658096112641,0.28697071727374751,0.28814202632384445,0.28902050811141716,0.28960616263646566,0.28989898989898988,0.28989898989898988,null,8,0.94047165991751169,8,0.37495092450271794]
[null,43,0.99898989898989909,43,0.99898989898989909,null,null,null,null,null,null,null,null,null,null,8,0,1.4545454545454545E-2,2.8760330578512398E-2,4.2644628099173555E-2,5.6198347107438013E-2,6.9421487603305784E-2,8.2314049586776863E-2,9.4876033057851236E-2,0.10710743801652893,0.11900826446280992,0.13057851239669421,0.14181818181818182,0.15272727272727274,0.16330578512396693,0.17355371900826444,0.18347107438016527,0.19305785123966943,0.20231404958677685,0.21123966942148761,0.21983471074380165,0.22809917355371903,0.23603305785123965,0.24363636363636365,0.25090909090909091,0.25785123966942147,0.26446280991735538,0.27074380165289258,0.27669421487603307,0.28231404958677686,0.287603305785124,0.29256198347107432,0.2971900826446281,0.30148760330578511,0.30545454545454548,0.30909090909090908,0.31239669421487604,0.31537190082644634,0.31801652892561982,0.32033057851239666,0.32231404958677684,0.32396694214876032,0.32528925619834709,0.32628099173553721,0.32694214876033062,0.32727272727272727,0.32727272727272727,null,9,0.515730940252073,9,0.73536507766554293]
[null,42,0.99696969696969695,42,0.99696969696969695,null,null,null,null,null,null,null,null,null,null,9,0,1.6161616161616162E-2,3.1955922865013781E-2,4.7382920110192843E-2,6.2442607897153349E-2,7.7134986225895305E-2,9.1460055096418733E-2,0.10541781450872359,0.11900826446280992,0.13223140495867769,0.14508723599632692,0.15757575757575759,0.16969696969696971,0.18145087235996327,0.1928374655647383,0.20385674931129474,0.21450872359963272,0.22479338842975208,0.23471074380165291,0.24426078971533519,0.25344352617079891,0.2622589531680441,0.27070707070707073,0.27878787878787875,0.28650137741046833,0.29384756657483935,0.30082644628099175,0.30743801652892561,0.31368227731864096,0.31955922865013781,0.32506887052341593,0.33021120293847567,0.33498622589531685,0.33939393939393941,0.34343434343434343,0.34710743801652894,0.35041322314049589,0.35335169880624429,0.35592286501377413,0.35812672176308541,0.35996326905417814,0.36143250688705236,0.36253443526170798,0.36326905417814515,0.36363636363636365,0.36363636363636365,null,10,0.57789036793515736,10,0.70662525162803858]
[null,41,0.9939393939393939,41,0.9939393939393939,null,null,null,null,null,null,null,null,null,null,10,0,1.7732884399551067E-2,3.5062748699112342E-2,5.1989592898683809E-2,6.8513416998265478E-2,8.4634220997857362E-2,0.10035200489745945,0.11566676869707172,0.13057851239669421,0.14508723599632692,0.1591929394959698,0.17289562289562291,0.18619528619528622,0.1990919293949597,0.21158555249464339,0.22367615549433731,0.23536373839404146,0.24664830119375575,0.25752984389348027,0.26800836649321497,0.27808386899295995,0.28775635139271505,0.29702581369248038,0.30589225589225588,0.31435567799204162,0.32241607999183763,0.33007346189164372,0.33732782369146008,0.34417916539128662,0.35062748699112339,0.35667278849097028,0.36231506989082746,0.36755433119069486,0.37239057239057244,0.37682379349046013,0.38085399449035817,0.38448117539026633,0.38770533619018471,0.39052647689011327,0.39294459749005206,0.39495969799000102,0.39657177838996022,0.39778083868992958,0.39858687888990924,0.39898989898989901,0.39898989898989901,null,11,0.93128618824704801,11,0.85353314276691472]
[null,40,0.98989898989898983,40,0.98989898989898983,null,null,null,null,null,null,null,null,null,null,11,0,1.9259259259259261E-2,3.808080808080809E-2,5.6464646464646467E-2,7.4410774410774413E-2,9.1919191919191914E-2,0.108989898989899,0.12562289562289561,0.14181818181818182,0.15757575757575759,0.17289562289562291,0.18777777777777779,0.20222222222222222,0.21622895622895624,0.22979797979797981,0.24292929292929291,0.25562289562289564,0.26787878787878788,0.27969696969696972,0.2910774410774411,0.30202020202020208,0.31252525252525254,0.3225925925925926,0.3322222222222222,0.34141414141414139,0.35016835016835024,0.35848484848484852,0.36636363636363639,0.37380471380471381,0.38080808080808087,0.38737373737373731,{"$f":"VLOOKUP($P20,$D$15:$E$60,2,FALSE)*VLOOKUP(AV$8,$B$15:$C$60,2,FALSE)","v":0.39350168350168352},0.39919191919191921,0.40444444444444444,0.40925925925925927,0.41363636363636369,0.41757575757575766,0.42107744107744111,0.42414141414141415,0.4267676767676768,0.42895622895622892,0.4307070707070707,0.43202020202020203,0.43289562289562294,0.43333333333333335,0.43333333333333335,null,12,0.34344151197977169,12,0.76476003216184485]
[null,39,0.98484848484848486,39,0.98484848484848486,null,null,null,null,null,null,null,null,null,null,12,0,2.074074074074074E-2,4.1010101010101017E-2,6.0808080808080811E-2,8.0134680134680128E-2,9.8989898989898975E-2,0.11737373737373738,0.13528619528619529,0.15272727272727274,0.16969696969696971,0.18619528619528622,0.20222222222222222,0.21777777777777779,0.23286195286195285,0.24747474747474746,0.26161616161616158,0.2752861952861953,0.28848484848484846,0.30121212121212126,0.31346801346801345,0.32525252525252529,0.33656565656565657,0.34740740740740744,0.35777777777777775,0.36767676767676766,0.37710437710437716,0.38606060606060605,0.39454545454545453,0.40255892255892256,0.41010101010101013,0.41717171717171714,0.42377104377104374,0.42989898989898995,0.43555555555555558,0.44074074074074071,0.44545454545454549,0.44969696969696976,0.45346801346801352,0.45676767676767677,0.45959595959595961,0.46195286195286195,0.46383838383838383,0.46525252525252525,0.46619528619528627,0.46666666666666667,0.46666666666666667,null,13,0.10240583573093054,13,0.70669468221519571]
[null,38,0.97878787878787876,38,0.97878787878787876,null,null,null,null,null,null,null,null,null,null,13,0,2.2177328843995512E-2,4.3850627486991131E-2,6.501989592898684E-2,8.5685134169982649E-2,0.10584634220997856,0.12550352004897461,0.14465666768697069,0.16330578512396693,0.18145087235996327,0.1990919293949597,0.21622895622895624,0.23286195286195285,0.24899091929394959,0.26461585552494643,0.27973676155494337,0.29435363738394044,0.30846648301193752,0.32207529843893484,0.33518008366493213,0.34778083868992959,0.35987756351392713,0.3714702581369248,0.38255892255892254,0.39314355677992041,0.40322416079991841,0.41280073461891642,0.42187327823691462,0.43044179165391289,0.43850627486991128,0.44606672788490964,0.45312315069890824,0.45967554331190696,0.46572390572390571,0.47126823793490458,0.47630853994490358,0.4808448117539027,0.48487705336190184,0.48840526476890112,0.49142944597490051,0.49394959697989999,0.49596571778389958,0.49747780838689926,0.49848586878889911,0.49898989898989898,0.49898989898989898,null,14,0.26317878438915132,14,0.33424742356217563]
[null,37,0.97171717171717176,37,0.97171717171717176,null,null,null,null,null,null,null,null,null,null,14,0,2.3569023569023569E-2,4.6602387511478424E-2,6.9100091827364554E-2,9.1062136516681963E-2,0.11248852157943065,0.13337924701561066,0.1537343128252219,0.17355371900826444,0.1928374655647383,0.21158555249464339,0.22979797979797981,0.24747474747474746,0.26461585552494643,0.28122130394857664,0.29729109274563814,0.31282522191613099,0.32782369146005508,0.34228650137741046,0.35621365166819713,0.36960514233241509,0.38246097337006424,0.39478114478114479,0.40656565656565652,0.4178145087235996,0.42852770125497402,0.43870523415977958,0.44834710743801653,0.45745332108968473,0.46602387511478421,0.47405876951331488,0.48155800428527695,0.48852157943067032,0.49494949494949492,0.50084175084175075,0.50619834710743805,0.51101928374655647,0.51530456075910624,0.51905417814508714,0.5222681359044995,0.52494643403734309,0.52708907254361792,0.5286960514233241,0.52976737067646162,0.53030303030303028,0.53030303030303028,null,15,0.12612461589665047,15,0.99580896139756392]
[null,36,0.96363636363636374,36,0.96363636363636374,null,null,null,null,null,null,null,null,null,null,15,0,2.4915824915824916E-2,4.9265381083562904E-2,7.3048668503213954E-2,9.626568717477807E-2,0.11891643709825525,0.14100091827364553,0.16251913070094887,0.18347107438016527,0.20385674931129474,0.22367615549433731,0.24292929292929291,0.26161616161616158,0.27973676155494337,0.29729109274563814,0.31427915518824606,0.33070094888276702,0.34655647382920107,0.36184573002754822,0.37656871747780835,0.39072543617998162,0.40431588613406788,0.41734006734006729,0.42979797979797973,0.44168962350780527,0.45301499846954396,0.46377410468319552,0.47396694214876028,0.48359351086623809,0.49265381083562904,0.50114784205693286,0.50907560453014988,0.51643709825528006,0.52323232323232316,0.52946127946127941,0.5351239669421487,0.54022038567493114,0.5447505356596265,0.54871441689623501,0.55211202938475656,0.55494337312519126,0.557208448117539,0.55890725436179978,0.5600397918579737,0.56060606060606055,0.56060606060606055,null,16,0.40317863824723943,16,0.15415007741899112]
[null,35,0.95454545454545459,35,0.95454545454545459,null,null,null,null,null,null,null,null,null,null,16,0,2.6217732884399554E-2,5.1839608203244576E-2,7.6865625956535052E-2,0.101295786144271,0.1251300887664524,0.1483685338230793,0.17101112131415161,0.19305785123966943,0.21450872359963272,0.23536373839404146,0.25562289562289564,0.2752861952861953,0.29435363738394044,0.31282522191613099,0.33070094888276702,0.34798081828384864,0.36466483011937556,0.38075298438934807,0.39624528109376594,0.41114172023262935,0.42544230180593817,0.43914702581369253,0.45225589225589224,0.46476890113253749,0.47668605244362827,0.48800734618916441,0.49873278236914603,0.50886236098357318,0.5183960820324458,0.52733394551576362,0.5356759514335272,0.54342209978573619,0.5505723905723906,0.55712682379349043,0.56308539944903591,0.56844811753902669,0.573214978063463,0.57738598102234462,0.58096112641567188,0.58394041424344456,0.58632384450566266,0.58811141720232629,0.58930313233343545,0.58989898989898992,0.58989898989898992,null,17,0.73711888219062416,17,0.22986921131790805]
[null,34,0.94444444444444442,34,0.94444444444444442,null,null,null,null,null,null,null,null,null,null,17,0,2.7474747474747475E-2,5.4325068870523421E-2,8.0550964187327823E-2,0.10615243342516069,0.13112947658402202,0.15548209366391186,0.17921028466483011,0.20231404958677685,0.22479338842975208,0.24664830119375575,0.26787878787878788,0.28848484848484846,0.30846648301193752,0.32782369146005508,0.34655647382920107,{"$f":"VLOOKUP($P26,$D$15:$E$60,2,FALSE)*VLOOKUP(AG$8,$B$15:$C$60,2,FALSE)","v":0.36466483011937556},0.38214876033057849,0.39900826446280996,0.41524334251606976,0.43085399449035816,0.44584022038567489,0.46020202020202022,0.47393939393939388,0.48705234159779609,0.49954086317722685,0.51140495867768598,0.52264462809917356,0.53325987144168963,0.54325068870523419,0.55261707988980702,0.56135904499540856,0.5694765840220386,0.57696969696969691,0.58383838383838382,0.59008264462809923,0.59570247933884302,0.6006978879706153,0.60506887052341596,0.60881542699724522,0.61193755739210276,0.6144352617079889,0.61630853994490353,0.61755739210284666,0.61818181818181817,0.61818181818181817,null,18,0.79706401046284592,18,0.32823853989070906]
[null,33,0.93333333333333335,33,0.93333333333333335,null,null,null,null,null,null,null,null,null,null,18,0,2.8686868686868691E-2,5.672176308539946E-2,8.4104683195592292E-2,0.1108356290174472,0.13691460055096419,0.16234159779614327,0.18711662075298438,0.21123966942148761,0.23471074380165291,0.25752984389348027,0.27969696969696972,0.30121212121212126,0.32207529843893484,0.34228650137741046,0.36184573002754822,0.38075298438934807,0.39900826446280996,0.41661157024793394,0.43356290174471995,0.44986225895316811,0.46550964187327826,0.48050505050505055,0.49484848484848487,0.50853994490358123,0.52157943067033985,0.53396694214876039,0.54570247933884297,0.5567860422405877,0.56721763085399457,0.57699724517906337,0.58612488521579431,0.5946005509641874,0.60242424242424253,0.60959595959595958,0.61611570247933889,0.62198347107438023,0.62719926538108361,0.63176308539944903,0.63567493112947659,0.63893480257116619,0.64154269972451794,0.64349862258953172,0.64480257116620765,0.6454545454545455,0.6454545454545455,null,19,0.37166295628035961,19,0.49864249612179568]
[null,32,0.92121212121212126,32,0.92121212121212126,null,null,null,null,null,null,null,null,null,null,19,0,2.985409652076319E-2,5.9029690847872671E-2,8.7526782981328446E-2,0.11534537292113049,0.14248546066727882,0.16894704621977349,0.19473012957861441,0.21983471074380165,0.24426078971533519,0.26800836649321497,0.2910774410774411,0.31346801346801345,0.33518008366493213,0.35621365166819713,0.37656871747780835,0.39624528109376594,0.41524334251606976,0.43356290174471995,0.45120395877971636,0.4681665136210591,0.48445056626874805,0.50005611672278338,0.51498316498316499,0.52923171104989286,0.54280175492296712,0.55569329660238753,0.56790633608815422,0.57944087338026729,0.59029690847872673,0.60047444138353223,0.60997347209468422,0.61879400061218248,0.6269360269360269,0.6343995510662177,0.64118457300275489,0.64729109274563823,0.65271911029486784,0.65746862565044384,0.6615396388123661,0.66493214978063453,0.66764615855524945,0.66968166513621052,0.67103866952351809,0.67171717171717171,0.67171717171717171,null,20,0.55800554122409918,20,0.43952764800186583]
[null,31,0.90808080808080804,31,0.90808080808080804,null,null,null,null,null,null,null,null,null,null,20,0,3.097643097643098E-2,6.1248852157943082E-2,9.0817263544536286E-2,0.11968166513621059,0.14784205693296601,0.1752984389348026,0.20205081114172024,0.22809917355371903,0.25344352617079891,0.27808386899295995,0.30202020202020208,0.32525252525252529,0.34778083868992959,0.36960514233241509,0.39072543617998162,0.41114172023262935,0.43085399449035816,0.44986225895316811,0.4681665136210591,0.48576675849403128,0.50266299357208455,0.5188552188552189,0.53434343434343434,0.54912764003673098,0.56320783593510881,0.57658402203856751,0.58925619834710752,0.6012243648607285,0.61248852157943079,0.62304866850321394,0.6329048056320784,0.64205693296602395,0.65050505050505059,0.65824915824915831,0.66528925619834722,0.67162534435261723,0.6772574227119682,0.68218549127640038,0.68640955004591375,0.6899295990205081,0.69274563820018364,0.69485766758494039,0.69626568717477821,0.69696969696969702,0.69696969696969702,null,21,0.28855780958897603,21,0.65220956618440729]
[null,30,0.89393939393939381,30,0.89393939393939381,null,null,null,null,null,null,null,null,null,null,21,0,3.2053872053872057E-2,6.3379247015610651E-2,9.3976124885215798E-2,0.12384450566268747,0.15298438934802569,0.18139577594123049,0.20907866544230178,0.23603305785123965,0.2622589531680441,0.28775635139271505,0.31252525252525254,0.33656565656565657,0.35987756351392713,0.38246097337006424,0.40431588613406788,0.42544230180593817,0.44584022038567489,0.46550964187327826,0.48445056626874805,0.50266299357208455,0.52014692378328742,0.53690235690235688,0.55292929292929283,0.56822773186409548,0.58279767370676472,0.59663911845730022,0.60975206611570243,0.62213651668197123,0.63379247015610662,0.64471992653810828,0.65491888582797675,0.6643893480257117,0.67313131313131314,0.68114478114478116,0.68842975206611567,0.69498622589531689,0.70081420263238448,0.70591368227731865,0.71028466483011932,0.71392715029078657,0.71684113865932042,0.71902662993572086,0.72048362411998779,0.72121212121212119,0.72121212121212119,null,22,0.37697825207843694,22,0.62275301151954332]
[null,29,0.8787878787878789,29,0.8787878787878789,null,null,null,null,null,null,null,null,null,null,22,0,3.3086419753086418E-2,6.5420875420875435E-2,9.7003367003367008E-2,0.12783389450056118,0.15791245791245789,0.18723905723905726,0.21581369248035914,0.24363636363636365,0.27070707070707073,0.29702581369248038,0.3225925925925926,0.34740740740740744,0.3714702581369248,0.39478114478114479,0.41734006734006729,0.43914702581369253,0.46020202020202022,0.48050505050505055,0.50005611672278338,0.5188552188552189,0.53690235690235688,0.55419753086419754,0.57074074074074066,0.58653198653198657,0.60157126823793494,0.61585858585858588,0.62939393939393939,0.64217732884399548,0.65420875420875435,0.66548821548821546,0.67601571268237937,0.68579124579124584,0.69481481481481489,0.70308641975308639,0.71060606060606069,0.71737373737373744,0.72338945005611677,0.72865319865319866,0.73316498316498324,0.73692480359147028,0.73993265993265989,0.74218855218855218,0.74369248035914715,0.74444444444444446,0.74444444444444446,null,23,0.51122063657806571,23,0.31645376646147905]
[null,28,0.86262626262626263,28,0.86262626262626263,null,null,null,null,null,null,null,null,null,null,23,0,{"$f":"VLOOKUP($P32,$D$15:$E$60,2,FALSE)*VLOOKUP(R$8,$B$15:$C$60,2,FALSE)","v":3.4074074074074076E-2},6.7373737373737377E-2,9.989898989898989E-2,0.13164983164983163,0.16262626262626259,0.19282828282828282,0.22225589225589223,0.25090909090909091,0.27878787878787875,0.30589225589225588,0.3322222222222222,0.35777777777777775,0.38255892255892254,0.40656565656565652,0.42979797979797973,0.45225589225589224,0.47393939393939388,0.49484848484848487,0.51498316498316499,0.53434343434343434,0.55292929292929283,0.57074074074074066,0.58777777777777773,0.60404040404040393,0.6195286195286196,0.63424242424242416,0.64818181818181808,0.66134680134680135,0.67373737373737375,0.68535353535353516,0.69619528619528614,0.70626262626262626,0.7155555555555555,0.72407407407407398,0.73181818181818181,0.73878787878787877,0.74498316498316497,0.7504040404040403,0.75505050505050497,0.75892255892255878,0.76202020202020193,0.76434343434343432,0.76589225589225596,0.76666666666666661,0.76666666666666661,null,24,0.4427138978609102,24,0.79374445763032297]
[null,27,0.84545454545454546,27,0.84545454545454546,null,null,null,null,null,null,null,null,null,null,24,0,3.5016835016835016E-2,6.923783287419652E-2,0.10266299357208448,0.13529231711049891,0.16712580348943984,0.19816345270890726,0.22840526476890111,0.25785123966942147,0.28650137741046833,0.31435567799204162,0.34141414141414139,0.36767676767676766,0.39314355677992041,0.4178145087235996,0.44168962350780527,0.46476890113253749,0.48705234159779609,0.50853994490358123,0.52923171104989286,0.54912764003673098,0.56822773186409548,0.58653198653198657,0.60404040404040393,0.62075298438934801,0.63666972757881857,0.6517906336088154,0.66611570247933882,0.67964493419038874,0.69237832874196514,0.70431588613406781,0.7154576063666972,0.72580348943985307,0.73535353535353531,0.74410774410774405,0.75206611570247939,0.7592286501377411,0.76559534741352919,0.77116620752984388,0.77594123048668506,0.77992041628405251,0.78310376492194667,0.78549127640036731,0.78708295071931444,0.78787878787878785,0.78787878787878785,null,25,0.63987113698706932,25,0.56944136082241559]
[null,26,0.82727272727272727,26,0.82727272727272727,null,null,null,null,null,null,null,null,null,null,25,0,3.5914702581369251E-2,7.1013161922252849E-2,0.10529537802265077,0.13876135088256303,0.17141108050198958,0.20324456688093054,0.23426181001938579,0.26446280991735538,0.29384756657483935,0.32241607999183763,0.35016835016835024,0.37710437710437716,0.40322416079991841,0.42852770125497402,0.45301499846954396,0.47668605244362827,0.49954086317722685,0.52157943067033985,0.54280175492296712,0.56320783593510881,0.58279767370676472,0.60157126823793494,0.6195286195286196,0.63666972757881857,0.65299459238853197,0.66850321395775947,0.68319559228650151,0.69707172737475775,0.71013161922252843,0.72237526782981332,0.73380267319661263,0.74441383532292638,0.75420875420875433,0.7631874298540966,0.7713498622589533,0.77869605142332432,0.78522599734720955,0.79093970003060921,0.79583715947352318,0.79991837567595148,0.8031833486378942,0.80563207835935113,0.80726456484032261,0.80808080808080818,0.80808080808080818,null,26,6.708996845063131E-2,26,0.52184941497705328]
[null,25,0.80808080808080818,25,0.80808080808080818,null,null,null,null,null,null,null,null,null,null,26,0,3.6767676767676769E-2,7.269972451790635E-2,0.10779614325068872,0.14205693296602387,0.17548209366391182,0.20807162534435261,0.23982552800734616,0.27074380165289258,0.30082644628099175,0.33007346189164372,0.35848484848484852,0.38606060606060605,0.41280073461891642,0.43870523415977958,0.46377410468319552,0.48800734618916441,0.51140495867768598,0.53396694214876039,0.55569329660238753,0.57658402203856751,0.59663911845730022,0.61585858585858588,0.63424242424242416,0.6517906336088154,0.66850321395775947,0.68438016528925616,0.6994214876033058,0.71362718089990818,0.7269972451790635,0.73953168044077122,0.75123048668503212,0.76209366391184574,0.7721212121212121,0.78131313131313129,0.78966942148760333,0.79719008264462821,0.8038751147842057,0.80972451790633604,0.81473829201101933,0.81891643709825523,0.82225895316804409,0.82476584022038568,0.82643709825528011,0.82727272727272727,0.82727272727272727,null,27,0.51084950545125296,27,0.63017171017565587]
[null,24,0.78787878787878785,24,0.78787878787878785,null,null,null,null,null,null,null,null,null,null,27,0,3.7575757575757575E-2,7.4297520661157038E-2,0.11016528925619835,0.14517906336088154,0.17933884297520658,0.21264462809917356,0.24509641873278235,0.27669421487603307,0.30743801652892561,0.33732782369146008,0.36636363636363639,0.39454545454545453,0.42187327823691462,0.44834710743801653,0.47396694214876028,0.49873278236914603,0.52264462809917356,0.54570247933884297,0.56790633608815422,0.58925619834710752,0.60975206611570243,0.62939393939393939,0.64818181818181808,0.66611570247933882,0.68319559228650151,0.6994214876033058,0.71479338842975204,0.72931129476584022,0.74297520661157035,0.75578512396694209,0.76774104683195588,0.77884297520661161,0.78909090909090907,0.79848484848484846,0.80702479338842981,0.81471074380165298,0.82154269972451799,0.82752066115702483,0.83264462809917361,0.83691460055096412,0.84033057851239668,0.84289256198347107,0.8446005509641874,0.84545454545454546,0.84545454545454546,null,28,0.45729788198349197,28,0.4602332729563724]
[null,23,0.76666666666666661,23,0.76666666666666661,null,null,null,null,null,null,null,null,null,null,28,0,3.8338945005611677E-2,7.5806550352004912E-2,0.11240281603917968,0.148127742067136,0.18298132843587386,0.21696357514539333,0.25007448219569428,0.28231404958677686,0.31368227731864096,0.34417916539128662,0.37380471380471381,0.40255892255892256,0.43044179165391289,0.45745332108968473,0.48359351086623809,0.50886236098357318,0.53325987144168963,0.5567860422405877,0.57944087338026729,0.6012243648607285,0.62213651668197123,0.64217732884399548,0.66134680134680135,0.67964493419038874,0.69707172737475775,0.71362718089990818,0.72931129476584022,0.74412406897255379,0.75806550352004909,0.77113559840832557,{"$f":"VLOOKUP($P37,$D$15:$E$60,2,FALSE)*VLOOKUP(AV$8,$B$15:$C$60,2,FALSE)","v":0.78333435363738391},0.79466176920722376,0.80511784511784512,0.814702581369248,0.82341597796143251,0.83125803489439865,0.83822875216814619,0.84432812978267524,0.84955616773798592,0.85391286603407812,0.85739822467095195,0.86001224364860729,0.86175492296704426,0.86262626262626263,0.86262626262626263,null,29,0.58847405906632455,29,0.2210982239259639]
[null,22,0.74444444444444446,22,0.74444444444444446,null,null,null,null,null,null,null,null,null,null,29,0,3.9057239057239061E-2,7.7226813590449972E-2,0.11450872359963271,0.15090296908478729,0.1864095500459137,0.22102846648301197,0.25475971839608202,0.287603305785124,0.31955922865013781,0.35062748699112339,0.38080808080808087,0.41010101010101013,0.43850627486991128,0.46602387511478421,0.49265381083562904,0.5183960820324458,0.54325068870523419,0.56721763085399457,0.59029690847872673,0.61248852157943079,0.63379247015610662,0.65420875420875435,0.67373737373737375,0.69237832874196514,0.71013161922252843,0.7269972451790635,0.74297520661157035,0.75806550352004909,0.77226813590449972,0.78558310376492191,0.79801040710131621,0.8095500459136824,0.82020202020202027,0.82996632996633002,0.83884297520661166,0.8468319559228652,0.8539332721150904,0.8601469237832875,0.86547291092745648,0.86991123354759725,0.87346189164370991,0.87612488521579435,0.87790021426385079,0.8787878787878789,0.8787878787878789,null,30,0.96607492637011338,30,0.44119505407806248]
[null,21,0.72121212121212119,21,0.72121212121212119,null,null,null,null,null,null,null,null,null,null,30,0,3.9730639730639727E-2,7.8558310376492191E-2,0.11648301193755738,0.1535047444138353,0.18962350780532594,0.22483930211202935,0.25915212733394544,0.29256198347107432,0.32506887052341593,0.35667278849097028,0.38737373737373731,0.41717171717171714,0.44606672788490964,0.47405876951331488,0.50114784205693286,0.52733394551576362,0.55261707988980702,0.57699724517906337,0.60047444138353223,0.62304866850321394,0.64471992653810828,0.66548821548821546,0.68535353535353516,0.70431588613406781,0.72237526782981332,0.73953168044077122,0.75578512396694209,0.77113559840832557,0.78558310376492191,0.79912764003673076,0.81176920722375256,0.82350780532598711,0.83434343434343428,0.84427609427609418,0.85330578512396682,0.86143250688705231,0.86865625956535042,0.87497704315886116,0.88039485766758485,0.88490970309152106,0.88852157943067023,0.89123048668503202,0.89303642485460666,0.89393939393939381,0.89393939393939381,null,31,0.11970900900169767,31,0.1185344318868492]
[null,20,0.69696969696969702,20,0.69696969696969702,null,null,null,null,null,null,null,null,null,null,31,0,4.0359147025813689E-2,7.9801040710131624E-2,0.11832568105295378,0.15593306805428017,0.19262320171411076,0.22839608203244566,0.26325170900928474,0.2971900826446281,0.33021120293847567,0.36231506989082746,0.39350168350168352,0.42377104377104374,0.45312315069890824,0.48155800428527695,0.50907560453014988,0.5356759514335272,0.56135904499540856,0.58612488521579431,0.60997347209468422,0.6329048056320784,0.65491888582797675,0.67601571268237937,0.69619528619528614,0.7154576063666972,0.73380267319661263,0.75123048668503212,0.76774104683195588,0.78333435363738391,0.79801040710131621,0.81176920722375256,0.8246107540046933,0.83653504744413831,0.84754208754208749,0.85763187429854093,0.86680440771349865,0.87505968778696053,0.88239771451892668,0.88881848790939699,0.89432200795837158,0.89890827466585033,0.90257728803183346,0.90532904805632075,0.90716355473931243,0.90808080808080804,0.90808080808080804,null,32,0.98453967286283361,32,0.7233366052126925]
[null,19,0.67171717171717171,19,0.67171717171717171,null,null,null,null,null,null,null,null,null,null,32,0,4.0942760942760947E-2,8.0955004591368243E-2,0.12003673094582187,0.15818794000612182,0.19540863177226814,0.23169880624426081,0.26705846342209977,0.30148760330578511,0.33498622589531685,0.36755433119069486,0.39919191919191921,0.42989898989898995,0.45967554331190696,0.48852157943067032,0.51643709825528006,0.54342209978573619,0.5694765840220386,0.5946005509641874,0.61879400061218248,0.64205693296602395,0.6643893480257117,0.68579124579124584,0.70626262626262626,0.72580348943985307,0.74441383532292638,0.76209366391184574,0.77884297520661161,0.79466176920722376,0.8095500459136824,0.82350780532598711,0.83653504744413831,0.84863177226813602,0.85979797979797989,0.87003367003367005,0.8793388429752067,0.88771349862258964,0.89515763697581885,0.90167125803489445,0.90725436179981644,0.91190694827058461,0.91562901744719927,0.91842056932966032,0.92028160391796765,0.92121212121212126,0.92121212121212126,null,33,0.82483639509213857,33,0.10673745201060969]
[null,18,0.6454545454545455,18,0.6454545454545455,null,null,null,null,null,null,null,null,null,null,33,0,4.148148148148148E-2,8.2020202020202035E-2,0.12161616161616162,0.16026936026936026,0.19797979797979795,0.23474747474747476,0.27057239057239058,0.30545454545454548,0.33939393939393941,0.37239057239057244,0.40444444444444444,0.43555555555555558,0.46572390572390571,0.49494949494949492,0.52323232323232316,0.5505723905723906,0.57696969696969691,0.60242424242424253,0.6269360269360269,0.65050505050505059,0.67313131313131314,0.69481481481481489,0.7155555555555555,0.73535353535353531,0.75420875420875433,0.7721212121212121,0.78909090909090907,0.80511784511784512,0.82020202020202027,0.83434343434343428,0.84754208754208749,0.85979797979797989,0.87111111111111117,0.88148148148148142,0.89090909090909098,0.89939393939393952,0.90693602693602704,0.91353535353535353,0.91919191919191923,0.9239057239057239,0.92767676767676766,0.9305050505050505,0.93239057239057255,0.93333333333333335,0.93333333333333335,null,34,0.27627608716049923,34,0.66350924446480819]
[null,17,0.61818181818181817,17,0.61818181818181817,null,null,null,null,null,null,null,null,null,null,34,0,4.1975308641975309E-2,8.2996632996632999E-2,0.12306397306397307,0.16217732884399549,0.20033670033670031,0.23754208754208755,0.27379349046015711,0.30909090909090908,0.34343434343434343,0.37682379349046013,0.40925925925925927,0.44074074074074071,0.47126823793490458,0.50084175084175075,0.52946127946127941,{"$f":"VLOOKUP($P43,$D$15:$E$60,2,FALSE)*VLOOKUP(AG$8,$B$15:$C$60,2,FALSE)","v":0.55712682379349043},0.58383838383838382,0.60959595959595958,0.6343995510662177,0.65824915824915831,0.68114478114478116,0.70308641975308639,0.72407407407407398,0.74410774410774405,0.7631874298540966,0.78131313131313129,0.79848484848484846,0.814702581369248,0.82996632996633002,0.84427609427609418,0.85763187429854093,0.87003367003367005,0.88148148148148142,0.89197530864197527,0.90151515151515149,0.91010101010101019,0.91773288439955103,0.92441077441077435,0.93013468013468015,0.9349046015712682,0.93872053872053862,0.94158249158249152,0.9434904601571269,0.94444444444444442,0.94444444444444442,null,35,0.2253223487401449,35,0.20373526103590689]
[null,16,0.58989898989898992,16,0.58989898989898992,null,null,null,null,null,null,null,null,null,null,35,0,4.2424242424242427E-2,8.3884297520661177E-2,0.1243801652892562,0.16391184573002754,0.2024793388429752,0.2400826446280992,0.27672176308539942,0.31239669421487604,0.34710743801652894,0.38085399449035817,0.41363636363636369,0.44545454545454549,0.47630853994490358,0.50619834710743805,0.5351239669421487,0.56308539944903591,0.59008264462809923,0.61611570247933889,0.64118457300275489,0.66528925619834722,0.68842975206611567,0.71060606060606069,0.73181818181818181,0.75206611570247939,0.7713498622589533,0.78966942148760333,0.80702479338842981,0.82341597796143251,0.83884297520661166,0.85330578512396682,0.86680440771349865,0.8793388429752067,0.89090909090909098,0.90151515151515149,0.91115702479338856,0.91983471074380174,0.92754820936639126,0.93429752066115701,0.94008264462809921,0.94490358126721763,0.94876033057851239,0.95165289256198349,0.95358126721763103,0.95454545454545459,0.95454545454545459,null,36,0.68663480341841143,36,0.27784824688175447]
[null,15,0.56060606060606055,15,0.56060606060606055,null,null,null,null,null,null,null,null,null,null,36,0,4.2828282828282833E-2,8.4683195592286514E-2,0.12556473829201104,0.16547291092745639,0.20440771349862258,0.24236914600550968,0.27935720844811757,0.31537190082644634,0.35041322314049589,0.38448117539026633,0.41757575757575766,0.44969696969696976,0.4808448117539027,0.51101928374655647,0.54022038567493114,0.56844811753902669,0.59570247933884302,0.62198347107438023,0.64729109274563823,0.67162534435261723,0.69498622589531689,0.71737373737373744,0.73878787878787877,0.7592286501377411,0.77869605142332432,0.79719008264462821,0.81471074380165298,0.83125803489439865,0.8468319559228652,0.86143250688705231,0.87505968778696053,0.88771349862258964,0.89939393939393952,0.91010101010101019,0.91983471074380174,0.92859504132231419,0.93638200183654741,0.94319559228650141,0.9490358126721764,0.95390266299357207,0.95779614325068874,0.96071625344352629,0.96266299357208474,0.96363636363636374,0.96363636363636374,null,37,0.39839273781798379,37,0.40729356472024458]
[null,14,0.53030303030303028,14,0.53030303030303028,null,null,null,null,null,null,null,null,null,null,37,0,4.3187429854096522E-2,8.5393327211509037E-2,0.12661769207223753,0.16686052443628202,0.20612182430364248,0.24440159167431896,0.28169982654831138,0.31801652892561982,0.35335169880624429,0.38770533619018471,0.42107744107744111,0.45346801346801352,0.48487705336190184,0.51530456075910624,0.5447505356596265,0.573214978063463,0.6006978879706153,0.62719926538108361,0.65271911029486784,0.6772574227119682,0.70081420263238448,0.72338945005611677,0.74498316498316497,0.76559534741352919,0.78522599734720955,0.8038751147842057,0.82154269972451799,0.83822875216814619,0.8539332721150904,0.86865625956535042,0.88239771451892668,0.89515763697581885,0.90693602693602704,0.91773288439955103,0.92754820936639126,0.93638200183654741,0.94423426181001946,0.95110498928680753,0.95699418426691163,0.96190184675033152,0.96582797673706766,0.96877257422711971,0.97073563922048789,0.97171717171717176,0.97171717171717176,null,38,4.1521675613919506E-2,38,0.97195273868607779]
[null,13,0.49898989898989898,13,0.49898989898989898,null,null,null,null,null,null,null,null,null,null,38,0,4.35016835016835E-2,8.6014692378328747E-2,0.12753902662993571,0.16807468625650443,0.20762167125803488,0.24617998163452709,0.28374961738598098,0.32033057851239666,0.35592286501377413,0.39052647689011327,0.42414141414141415,0.45676767676767677,0.48840526476890112,0.51905417814508714,0.54871441689623501,0.57738598102234462,0.60506887052341596,0.63176308539944903,0.65746862565044384,0.68218549127640038,0.70591368227731865,0.72865319865319866,0.7504040404040403,0.77116620752984388,0.79093970003060921,0.80972451790633604,0.82752066115702483,0.84432812978267524,0.8601469237832875,0.87497704315886116,0.88881848790939699,0.90167125803489445,0.91353535353535353,0.92441077441077435,0.93429752066115701,0.94319559228650141,0.95110498928680753,0.95802571166207529,0.96395775941230488,0.9689011325374961,0.97285583103764917,0.97582185491276396,0.97779920416284061,0.97878787878787876,0.97878787878787876,null,39,0.43866165092417575,39,0.67679290305464923]
[null,12,0.46666666666666667,12,0.46666666666666667,null,null,null,null,null,null,null,null,null,null,39,0,4.3771043771043773E-2,8.6547291092745657E-2,0.1283287419651056,0.16911539638812365,0.2089072543617998,0.24770431588613409,0.28550658096112641,0.32231404958677684,0.35812672176308541,0.39294459749005206,0.4267676767676768,0.45959595959595961,0.49142944597490051,0.5222681359044995,0.55211202938475656,0.58096112641567188,0.60881542699724522,0.63567493112947659,0.6615396388123661,0.68640955004591375,0.71028466483011932,0.73316498316498324,0.75505050505050497,0.77594123048668506,0.79583715947352318,0.81473829201101933,0.83264462809917361,0.84955616773798592,0.86547291092745648,0.88039485766758485,0.89432200795837158,0.90725436179981644,0.91919191919191923,0.93013468013468015,0.94008264462809921,0.9490358126721764,0.95699418426691163,0.96395775941230488,0.96992653810835627,0.9749005203550658,0.97887970615243336,0.98186409550045917,0.98385368839914311,0.98484848484848486,0.98484848484848486,null,40,0.49141616545400435,40,0.94099158386286708]
[null,11,0.43333333333333335,11,0.43333333333333335,null,null,null,null,null,null,null,null,null,null,40,0,{"$f":"VLOOKUP($P49,$D$15:$E$60,2,FALSE)*VLOOKUP(R$8,$B$15:$C$60,2,FALSE)","v":4.3995510662177328E-2},8.6991123354759725E-2,0.12898683807774716,0.16998265483113967,0.20997857361493721,0.24897459442913988,0.28697071727374751,0.32396694214876032,0.35996326905417814,0.39495969799000102,0.42895622895622892,0.46195286195286195,0.49394959697989999,0.52494643403734309,0.55494337312519126,0.58394041424344456,0.61193755739210276,0.63893480257116619,0.66493214978063453,0.6899295990205081,0.71392715029078657,0.73692480359147028,0.75892255892255878,0.77992041628405251,0.79991837567595148,0.81891643709825523,0.83691460055096412,0.85391286603407812,0.86991123354759725,0.88490970309152106,0.89890827466585033,0.91190694827058461,0.9239057239057239,0.9349046015712682,0.94490358126721763,0.95390266299357207,0.96190184675033152,0.9689011325374961,0.9749005203550658,0.97990001020304041,0.98389960208142013,0.98689929599020498,0.98889909192939496,0.98989898989898983,0.98989898989898983,null,41,0.23110418485192541,41,0.13212207607882631]
[null,10,0.39898989898989901,10,0.39898989898989901,null,null,null,null,null,null,null,null,null,null,41,0,4.4175084175084173E-2,8.7346189164370994E-2,0.12951331496786042,0.1706764615855525,0.21083562901744718,0.24999081726354452,0.28814202632384445,0.32528925619834709,0.36143250688705236,0.39657177838996022,0.4307070707070707,0.46383838383838383,0.49596571778389958,0.52708907254361792,0.557208448117539,0.58632384450566266,0.6144352617079889,0.64154269972451794,0.66764615855524945,0.69274563820018364,0.71684113865932042,0.73993265993265989,0.76202020202020193,0.78310376492194667,0.8031833486378942,0.82225895316804409,0.84033057851239668,0.85739822467095195,0.87346189164370991,0.88852157943067023,0.90257728803183346,0.91562901744719927,0.92767676767676766,0.93872053872053862,0.94876033057851239,0.95779614325068874,0.96582797673706766,0.97285583103764917,0.97887970615243336,0.98389960208142013,0.98791551882460971,0.99092745638200175,0.99293541475359659,0.9939393939393939,0.9939393939393939,null,42,0.49432057033413213,42,0.83906025462789235]
[null,9,0.36363636363636365,9,0.36363636363636365,null,null,null,null,null,null,null,null,null,null,42,0,4.4309764309764313E-2,8.7612488521579435E-2,0.12990817263544538,0.1711968166513621,0.21147842056932964,0.25075298438934801,0.28902050811141716,0.32628099173553721,0.36253443526170798,0.39778083868992958,0.43202020202020203,0.46525252525252525,0.49747780838689926,0.5286960514233241,0.55890725436179978,0.58811141720232629,0.61630853994490353,0.64349862258953172,0.66968166513621052,0.69485766758494039,0.71902662993572086,0.74218855218855218,0.76434343434343432,0.78549127640036731,0.80563207835935113,0.82476584022038568,0.84289256198347107,0.86001224364860729,0.87612488521579435,0.89123048668503202,0.90532904805632075,0.91842056932966032,0.9305050505050505,0.94158249158249152,0.95165289256198349,0.96071625344352629,0.96877257422711971,0.97582185491276396,0.98186409550045917,0.98689929599020498,0.99092745638200175,0.99394857667584935,0.9959626568717479,0.99696969696969695,0.99696969696969695,null,43,0.53979855592063708,43,0.81612944375262564]
[null,8,0.32727272727272727,8,0.32727272727272727,null,null,null,null,null,null,null,null,null,null,43,0,4.4399551066217742E-2,8.7790021426385076E-2,0.13017141108050201,0.17154372002856852,0.21190694827058462,0.25126109580655037,0.28960616263646566,0.32694214876033062,0.36326905417814515,0.39858687888990924,0.43289562289562294,0.46619528619528627,0.49848586878889911,0.52976737067646162,0.5600397918579737,0.58930313233343545,0.61755739210284666,0.64480257116620765,0.67103866952351809,0.69626568717477821,0.72048362411998779,0.74369248035914715,0.76589225589225596,0.78708295071931444,0.80726456484032261,0.82643709825528011,0.8446005509641874,0.86175492296704426,0.87790021426385079,0.89303642485460666,0.90716355473931243,0.92028160391796765,0.93239057239057255,0.9434904601571269,0.95358126721763103,0.96266299357208474,0.97073563922048789,0.97779920416284061,0.98385368839914311,0.98889909192939496,0.99293541475359659,0.9959626568717479,0.99798081828384877,0.99898989898989909,0.99898989898989909,null,44,0.46071514259814184,44,0.18319604906266596]
[null,7,0.28989898989898988,7,0.28989898989898988,null,null,null,null,null,null,null,null,null,null,44,0,4.4444444444444446E-2,8.787878787878789E-2,0.13030303030303031,0.17171717171717171,0.2121212121212121,0.25151515151515152,0.28989898989898988,0.32727272727272727,0.36363636363636365,0.39898989898989901,0.43333333333333335,0.46666666666666667,0.49898989898989898,0.53030303030303028,0.56060606060606055,0.58989898989898992,0.61818181818181817,0.6454545454545455,0.67171717171717171,0.69696969696969702,0.72121212121212119,0.74444444444444446,0.76666666666666661,0.78787878787878785,0.80808080808080818,0.82727272727272727,0.84545454545454546,0.86262626262626263,0.8787878787878789,0.89393939393939381,0.90808080808080804,0.92121212121212126,0.93333333333333335,0.94444444444444442,0.95454545454545459,0.96363636363636374,0.97171717171717176,0.97878787878787876,0.98484848484848486,0.98989898989898983,0.9939393939393939,0.99696969696969695,0.99898989898989909,1,1,null,45,0.50735456264215228,45,0.76973994544699187]
[null,6,0.25151515151515152,6,0.25151515151515152,null,null,null,null,null,null,null,null,null,null,45,0,4.4444444444444446E-2,8.787878787878789E-2,0.13030303030303031,0.17171717171717171,0.2121212121212121,0.25151515151515152,0.28989898989898988,0.32727272727272727,0.36363636363636365,0.39898989898989901,0.43333333333333335,0.46666666666666667,0.49898989898989898,0.53030303030303028,0.56060606060606055,0.58989898989898992,0.61818181818181817,0.6454545454545455,0.67171717171717171,0.69696969696969702,0.72121212121212119,0.74444444444444446,0.76666666666666661,0.78787878787878785,0.80808080808080818,0.82727272727272727,0.84545454545454546,0.86262626262626263,0.8787878787878789,0.89393939393939381,{"$f":"VLOOKUP($P54,$D$15:$E$60,2,FALSE)*VLOOKUP(AV$8,$B$15:$C$60,2,FALSE)","v":0.90808080808080804},0.92121212121212126,0.93333333333333335,0.94444444444444442,0.95454545454545459,0.96363636363636374,0.97171717171717176,0.97878787878787876,0.98484848484848486,0.98989898989898983,0.9939393939393939,0.99696969696969695,0.99898989898989909,1,1]
[null,5,0.2121212121212121,5,0.2121212121212121]
[null,4,0.17171717171717171,4,0.17171717171717171,null,null,null,null,null,null,null,null,null,null,"Probabilidad de aprobar por tema estudiado"]
[null,3,0.13030303030303031,3,0.13030303030303031,null,null,null,null,null,null,null,null,null,null,null,"Temas que te sabes parte A"]
[null,2,8.787878787878789E-2,2,8.787878787878789E-2,null,null,null,null,null,null,null,null,null,null,null,0,1,2,3,4,5,6,7,8,9,10,11,12,13,14,15,16,17,18,19,20,21,22,23,24,25,26,27,28,29,30,31,32,33,34,35,36,37,38,39,40,41,42,43,44,45]
[null,1,4.4444444444444446E-2,1,4.4444444444444446E-2,null,null,null,null,null,null,null,null,null,"Temas que te sabes parte B",0,{"$f":"IFERROR((VLOOKUP($P59,$D$15:$E$60,2,FALSE)*VLOOKUP(Q$8,$B$15:$C$60,2,FALSE))/($P59+Q$58),0)","v":0},{"$f":"IFERROR((VLOOKUP($P59,$D$15:$E$60,2,FALSE)*VLOOKUP(R$8,$B$15:$C$60,2,FALSE))/($P59+R$58),0)","v":0},0,0,0,0,0,0,0,0,0,0,0,0,0,0,0,0,0,0,0,0,0,0,0,0,0,0,0,0,0,0,0,0,0,0,0,0,0,0,0,0,0,0,0,0]
[null,0,0,0,0,null,null,null,null,null,null,null,null,null,null,1,{"$f":"IFERROR((VLOOKUP($P60,$D$15:$E$60,2,FALSE)*VLOOKUP(Q$8,$B$15:$C$60,2,FALSE))/($P60+Q$58),0)","v":0},9.8765432098765434E-4,1.3019079685746354E-3,1.4478114478114479E-3,1.5263748597081931E-3,1.5712682379349044E-3,1.5969215969215971E-3,1.6105499438832771E-3,1.6161616161616162E-3,1.6161616161616162E-3,1.6120803999591878E-3,1.6049382716049384E-3,1.5954415954415953E-3,1.5840949174282509E-3,1.5712682379349046E-3,1.5572390572390572E-3,1.5422195814352678E-3,1.5263748597081931E-3,1.5098351940457206E-3,1.4927048260381594E-3,1.4750681417348085E-3,1.4569941842669117E-3,1.438539989264627E-3,1.4197530864197532E-3,1.4006734006734006E-3,1.3813347146680482E-3,1.3617658062102507E-3,1.341991341991342E-3,1.3220325864004027E-3,1.3019079685746354E-3,1.2816335396980557E-3,1.2612233445566778E-3,1.2406897255382106E-3,1.2200435729847494E-3,1.1992945326278659E-3,1.1784511784511786E-3,1.1575211575211577E-3,1.1365113119499084E-3,1.1154277820944487E-3,1.0942760942760942E-3,1.0730612356628618E-3,1.0517877184543852E-3,1.030459635110798E-3,1.0090807060504031E-3,9.8765432098765434E-4,9.6618357487922714E-4]
[null,null,null,null,null,null,null,null,null,null,null,null,null,null,null,2,0,1.3019079685746354E-3,1.9306703397612493E-3,2.2901744719926545E-3,2.5150494847464545E-3,2.6629935720844816E-3,2.7628558310376495E-3,2.8306635377342449E-3,2.8760330578512399E-3,2.9050838968194344E-3,2.9218957249260284E-3,2.9292929292929299E-3,2.9292929292929299E-3,2.9233751657994087E-3,2.9126492194674015E-3,2.8979635931507589E-3,2.8799782335135874E-3,2.8592141510801802E-3,2.8360881542699732E-3,2.8109376594225082E-3,2.7840387344519584E-3,2.7556194354613327E-3,2.725869809203143E-3,2.6949494949494949E-3,2.6629935720844816E-3,2.6301171082315868E-3,2.5964187327823696E-3,2.5619834710743808E-3,2.526885011733497E-3,2.4911875351758058E-3,2.454947199265381E-3,2.4182133548524736E-3,2.3810295468049483E-3,2.343434343434344E-3,2.3054620276842502E-3,2.267143176234086E-3,2.2285051471654348E-3,2.1895724926027957E-3,2.1503673094582188E-3,2.1109095388474552E-3,2.0712172227323744E-3,2.0313067247528138E-3,1.9911929209449871E-3,1.9508893650307794E-3,1.9104084321475629E-3,1.8697614442295296E-3]
[null,null,null,null,null,null,null,null,null,null,null,null,null,null,null,3,0,1.4478114478114479E-3,2.2901744719926545E-3,2.8298132843587388E-3,3.1964668328304693E-3,3.4550045913682276E-3,3.6414651566166723E-3,3.7774716865625951E-3,3.8767843726521412E-3,3.9485766758494039E-3,3.9991994537449081E-3,4.0331890331890335E-3,4.0538720538720544E-3,4.0637434955616775E-3,4.0647112839626211E-3,4.0582593612896638E-3,4.0455592608702661E-3,4.0275482093663911E-3,4.0049849140758233E-3,3.9784901355149295E-3,3.9485766758494039E-3,3.9156718702173252E-3,3.8801346801346803E-3,3.8422688422688417E-3,3.8023330952623884E-3,3.7605492150946701E-3,3.7171083879547835E-3,3.672176308539945E-3,3.6258972915864411E-3,3.5783976124885222E-3,3.5297882405320416E-3,3.4801670897927585E-3,3.4296208841663391E-3,3.3782267115600451E-3,3.3260533260533261E-3,3.2731622444541106E-3,3.2196086741541293E-3,3.165442301805938E-3,3.1107079665837981E-3,3.0554462372644189E-3,2.9996939087848177E-3,2.9434844310877368E-3,2.8868482807876752E-3,2.8298132843587393E-3,2.7724049000644748E-3,2.7146464646464648E-3]
[null,null,null,null,null,null,null,null,null,null,null,null,null,null,null,4,0,1.5263748597081931E-3,2.5150494847464545E-3,3.1964668328304693E-3,3.6858483828180796E-3,4.0472060674080872E-3,4.3189470462197729E-3,4.5255122390108612E-3,4.6831955922865013E-3,4.8032775305502573E-3,4.8938154998761059E-3,4.9607182940516279E-3,5.008417508417508E-3,5.0403020099989791E-3,5.059007584260109E-3,5.0666151144620033E-3,5.0647893072135498E-3,5.0548777821505086E-3,5.0379831371566907E-3,5.0150162139621949E-3,4.986736047342108E-3,4.953780226507499E-3,4.916688250021584E-3,4.8759196907345046E-3,4.8318684682321037E-3,4.7848741683642424E-3,4.7352310988674623E-3,4.6831955922865013E-3,4.6289919395979999E-3,4.5728172449935539E-3,4.5148454239363322E-3,4.4552305158365767E-3,4.3941094446144947E-3,4.331604331604331E-3,4.267824443263039E-3,4.202867839231475E-3,4.1368227731864099E-3,4.0697688886898054E-3,4.0017782442024865E-3,3.9329161950726428E-3,3.8632421552531743E-3,3.7928102574567224E-3,3.721669927203524E-3,3.6498663835865643E-3,3.5774410774410772E-3,3.5044320758606472E-3]
[null,null,null,null,null,null,null,null,null,null,null,null,null,null,null,5,0,1.5712682379349044E-3,2.6629935720844816E-3,3.4550045913682276E-3,4.0472060674080872E-3,4.4995408631772257E-3,4.8501544369312956E-3,5.1244770941740632E-3,5.3401144310235215E-3,5.5096418732782362E-3,5.6422813998571577E-3,5.7449494949494946E-3,5.8229352346999396E-3,5.8803523449988092E-3,5.9204485041805602E-3,5.9458218549127625E-3,5.9585756555453522E-3,5.9604307538191825E-3,5.952808719607139E-3,5.9368941944699513E-3,5.9136822773186402E-3,5.884014974924065E-3,5.8486095523132553E-3,5.8080808080808064E-3,5.7629587410151671E-3,5.713702683399653E-3,5.6607126988358651E-3,5.6043388429752056E-3,5.5448887404810259E-3,5.4826338248798144E-3,5.4178145087235979E-3,5.3506444920586324E-3,5.2813143722234635E-3,5.2099946836788938E-3,5.1368384701718029E-3,5.06198347107438E-3,4.9855539877712825E-3,4.9076624834200593E-3,4.8284109594891834E-3,4.7478921445863595E-3,4.6661905247763827E-3,4.583383239509721E-3,4.4995408631772265E-3,4.414728088970513E-3,4.3290043290043281E-3,4.242424242424242E-3]
[null,null,null,null,null,null,null,null,null,null,null,null,null,null,null,6,0,{"$f":"IFERROR((VLOOKUP($P65,$D$15:$E$60,2,FALSE)*VLOOKUP(R$8,$B$15:$C$60,2,FALSE))/($P65+R$58),0)","v":1.5969215969215971E-3},2.7628558310376495E-3,3.6414651566166723E-3,4.3189470462197729E-3,4.8501544369312956E-3,5.2716559534741357E-3,5.608768336041064E-3,5.8795749704840614E-3,6.0973370064279159E-3,6.2720003060912155E-3,6.4111705288175877E-3,6.5207631874298544E-3,6.6054484236302427E-3,6.6689623507805327E-3,6.7143294416021678E-3,6.7440242646854224E-3,6.7600910288657329E-3,6.7642332415059694E-3,6.7578818487909397E-3,6.742247651338561E-3,6.7183620718974258E-3,6.6871091871091876E-3,6.6492511320097522E-3,6.6054484236302419E-3,6.5562763509977593E-3,6.5022382920110191E-3,6.4437766090658655E-3,6.3812816219233331E-3,6.3150990423717704E-3,6.2455361697785934E-3,6.172867081957991E-3,6.0973370064279159E-3,6.0191660191660197E-3,5.9385521885521892E-3,5.8556742592219312E-3,5.7706939525121355E-3,5.6837579459143948E-3,5.5949995826028885E-3,5.5045403530252024E-3,5.4124911832421716E-3,5.3189535587988192E-3,5.2240205081114169E-3,5.1277774654398039E-3,5.0303030303030308E-3,4.9316696375519909E-3]
[null,null,null,null,null,null,null,null,null,null,null,null,null,null,null,7,0,1.6105499438832771E-3,2.8306635377342449E-3,3.7774716865625951E-3,4.5255122390108612E-3,5.1244770941740632E-3,5.608768336041064E-3,6.0029588817467599E-3,6.325068870523416E-3,6.5886134067952244E-3,6.803927570415984E-3,6.979049756827534E-3,7.1203260676944886E-3,7.2328333843485349E-3,7.3206815631058049E-3,7.3872332136794942E-3,7.4352661440935481E-3,7.467095194367921E-3,7.4846648301193754E-3,7.4896203684082464E-3,7.4833633756192681E-3,7.4670951943679202E-3,7.4418514648399705E-3,7.4085297418630741E-3,7.367911766738745E-3,7.3206815631058058E-3,7.2674402426468531E-3,7.2087181980230106E-3,7.1449852055912649E-3,7.0766588443356114E-3,7.0041115495660927E-3,6.9276765528759141E-3,6.8476529082589681E-3,6.7643097643097644E-3,6.677890011223344E-3,6.5886134067952244E-3,6.4966792662352925E-3,6.4022687851888948E-3,6.3055470530217995E-3,6.2066648035027485E-3,6.1057599419946278E-3,6.002958881746759E-3,5.8983777165595337E-3,5.7921232527293129E-3,5.6842939195880368E-3,5.5749805749805747E-3]
[null,null,null,null,null,null,null,null,null,null,null,null,null,null,null,8,0,1.6161616161616162E-3,2.8760330578512399E-3,3.8767843726521412E-3,4.6831955922865013E-3,5.3401144310235215E-3,5.8795749704840614E-3,6.325068870523416E-3,6.6942148760330581E-3,7.0004861448711717E-3,7.2543617998163451E-3,7.4641148325358848E-3,7.6363636363636373E-3,7.7764659582841393E-3,7.8888054094665653E-3,7.9770032339202285E-3,8.0440771349862255E-3,8.0925619834710735E-3,8.1246026700572162E-3,8.1420263238445052E-3,8.1463990554899654E-3,8.139070960387575E-3,8.1212121212121211E-3,8.0938416422287399E-3,8.057851239669421E-3,8.0140245429501638E-3,7.9630529897909575E-3,7.905548996458088E-3,7.8420569329660239E-3,7.7730623185168646E-3,7.6989995650282713E-3,7.620258529349438E-3,7.5371900826446282E-3,7.4501108647450119E-3,7.3593073593073589E-3,7.2650394003459543E-3,7.1675432006010533E-3,7.0670339761248853E-3,6.963708228530362E-3,6.8577457358888691E-3,6.7493112947658402E-3,6.638556248945859E-3,6.525619834710744E-3,6.4106303678496202E-3,6.2937062937062933E-3,6.1749571183533445E-3]
[null,null,null,null,null,null,null,null,null,null,null,null,null,null,null,9,0,1.6161616161616162E-3,2.9050838968194344E-3,3.9485766758494039E-3,4.8032775305502573E-3,5.5096418732782362E-3,6.0973370064279159E-3,6.5886134067952244E-3,7.0004861448711717E-3,7.3461891643709825E-3,7.6361703155961537E-3,7.8787878787878792E-3,8.0808080808080808E-3,8.2477669254528759E-3,8.384237633249492E-3,8.4940312213039482E-3,8.5803489439853081E-3,8.6458995549904653E-3,8.6929905111723296E-3,8.7235996326905426E-3,8.7394319369240997E-3,8.7419651056014694E-3,8.7324861518409905E-3,8.712121212121211E-3,8.6818599215293425E-3,8.6425754874952746E-3,8.5950413223140499E-3,8.5399449035812661E-3,8.4778993869902963E-3,8.4094533855299421E-3,8.3350992441901528E-3,8.2552800734618913E-3,8.1703957535443142E-3,8.0808080808080808E-3,7.9868451961475212E-3,7.888805409466567E-3,7.7869605142332418E-3,7.6815586697009629E-3,7.5728269151866838E-3,7.4609733700642797E-3,7.3461891643709825E-3,7.2286501377410474E-3,7.1085183384648623E-3,6.9859433495797147E-3,6.8610634648370496E-3,6.7340067340067346E-3]
[null,null,null,null,null,null,null,null,null,null,null,null,null,null,null,10,0,1.6120803999591878E-3,2.9218957249260284E-3,3.9991994537449081E-3,4.8938154998761059E-3,5.6422813998571577E-3,6.2720003060912155E-3,6.803927570415984E-3,7.2543617998163451E-3,7.6361703155961537E-3,7.9596469747984892E-3,8.2331248997915673E-3,8.4634220997857369E-3,8.6561708432591183E-3,8.8160646872768086E-3,8.947046219773493E-3,9.0524514766939027E-3,9.1351222664353988E-3,9.1974944247671525E-3,9.2416678101108606E-3,9.2694622997653315E-3,9.2824629481520985E-3,9.2820566778900118E-3,9.2694622997653298E-3,9.2457552350600474E-3,9.2118879997667904E-3,9.1687072747678802E-3,9.1169682078773E-3,9.0573464576654376E-3,8.9904483843877801E-3,8.9168197122742564E-3,8.8369529241665232E-3,8.7512935997784494E-3,8.660245869548196E-3,8.5641771247831847E-3,8.4634220997857369E-3,8.3582864215275294E-3,8.2490497061741431E-3,8.1359682685440259E-3,8.0192774997969816E-3,7.8991939598000212E-3,7.7759172233325532E-3,7.6496315132678766E-3,7.520507148866212E-3,7.3887018331462778E-3,7.2543617998163459E-3]
[null,null,null,null,null,null,null,null,null,null,null,null,null,null,null,11,0,1.6049382716049384E-3,2.9292929292929299E-3,4.0331890331890335E-3,4.9607182940516279E-3,5.7449494949494946E-3,6.4111705288175877E-3,6.979049756827534E-3,7.4641148325358848E-3,7.8787878787878792E-3,8.2331248997915673E-3,8.5353535353535365E-3,8.7922705314009662E-3,9.0095398428731762E-3,9.1919191919191921E-3,9.3434343434343429E-3,9.4675146526998384E-3,9.5670995670995677E-3,9.6447230929989566E-3,9.7025813692480367E-3,9.7425871619420019E-3,9.7664141414141419E-3,9.7755331088664431E-3,9.7712418300653584E-3,9.7546897546897538E-3,9.7268986157875072E-3,9.6887796887796893E-3,9.6411483253588531E-3,9.5847362514029175E-3,9.5202020202020225E-3,9.4481399359448125E-3,{"$f":"IFERROR((VLOOKUP($P70,$D$15:$E$60,2,FALSE)*VLOOKUP(AV$8,$B$15:$C$60,2,FALSE))/($P70+AV$58),0)","v":9.3690877024210362E-3},9.2835330044632371E-3,9.1919191919191921E-3,9.094650205761317E-3,8.9920948616600809E-3,8.8845905867182481E-3,8.7724466891133564E-3,8.6559472273757994E-3,8.5353535353535365E-3,8.410906450122135E-3,8.2828282828282824E-3,8.1513245664189063E-3,8.0165856091782024E-3,7.8787878787878792E-3,7.7380952380952384E-3]
[null,null,null,null,null,null,null,null,null,null,null,null,null,null,null,12,0,1.5954415954415953E-3,2.9292929292929299E-3,4.0538720538720544E-3,5.008417508417508E-3,5.8229352346999396E-3,6.5207631874298544E-3,7.1203260676944886E-3,7.6363636363636373E-3,8.0808080808080808E-3,8.4634220997857369E-3,8.7922705314009662E-3,9.0740740740740747E-3,9.3144781144781138E-3,9.518259518259518E-3,9.689487467265244E-3,9.8316498316498319E-3,9.9477533960292564E-3,1.0040404040404042E-2,1.0111871402193983E-2,1.0164141414141415E-2,1.0198959289868382E-2,1.0217864923747278E-2,1.0222222222222221E-2,1.021324354657688E-2,1.0192010192010194E-2,1.0159489633173844E-2,1.0116550116550117E-2,1.0063973063973063E-2,1.0002463661000247E-2,9.9326599326599319E-3,9.855140552814971E-3,9.7704315886134076E-3,9.6790123456790122E-3,9.5813204508856682E-3,9.4777562862669255E-3,9.36868686868687E-3,9.2544492544492547E-3,9.1353535353535346E-3,9.0116854822737177E-3,8.8837088837088844E-3,8.7516676195921479E-3,8.6157875046763942E-3,8.4762779308233862E-3,8.3333333333333332E-3,8.1871345029239772E-3]
[null,null,null,null,null,null,null,null,null,null,null,null,null,null,null,13,0,1.5840949174282509E-3,2.9233751657994087E-3,4.0637434955616775E-3,5.0403020099989791E-3,5.8803523449988092E-3,6.6054484236302427E-3,7.2328333843485349E-3,7.7764659582841393E-3,8.2477669254528759E-3,8.6561708432591183E-3,9.0095398428731762E-3,9.3144781144781138E-3,9.5765738189980618E-3,9.8005872416646826E-3,9.9905986269622632E-3,1.015012542703243E-2,1.0282216100397918E-2,1.0389525756094673E-2,1.0474377614529129E-2,1.0538813293634231E-2,1.0584634220997856E-2,1.061343594676928E-2,1.0626636737747849E-2,1.0625501534592444E-2,1.0611162126313642E-2,1.0584634220997856E-2,1.0546831955922865E-2,1.0498580284241778E-2,1.0440625592140745E-2,1.0373644834532783E-2,1.0298253424975187E-2,1.0215012073597932E-2,1.0124432733128385E-2,1.0026983785849033E-2,9.9230945821854911E-3,9.8131594235490345E-3,9.6975410672380368E-3,9.5765738189980618E-3,9.4505662687480868E-3,9.319803716601887E-3,9.1845503293314732E-3,9.045051061579986E-3,8.9015333712303413E-3,8.7542087542087539E-3,8.6032741205154997E-3]
[null,null,null,null,null,null,null,null,null,null,null,null,null,null,null,14,0,1.5712682379349046E-3,2.9126492194674015E-3,4.0647112839626211E-3,5.059007584260109E-3,5.9204485041805602E-3,6.6689623507805327E-3,7.3206815631058049E-3,7.8888054094665653E-3,8.384237633249492E-3,8.8160646872768086E-3,9.1919191919191921E-3,9.518259518259518E-3,9.8005872416646826E-3,1.0043617998163451E-2,1.0251416991228902E-2,1.0427507397204366E-2,1.0574957789034035E-2,1.0696453168044077E-2,1.0794353080854458E-2,1.0870739480365149E-2,1.0927456382001835E-2,1.0966142910587355E-2,1.0988260988260987E-2,1.0995118650621041E-2,1.0987889775768565E-2,1.0967630853994489E-2,1.0935295303366257E-2,1.0891745740230588E-2,1.0837764537553122E-2,1.0774062943484429E-2,1.0701288984117265E-2,1.0620034335449354E-2,1.053084031807436E-2,1.0434203142536473E-2,1.0330578512396695E-2,1.022038567493113E-2,1.0104010995276594E-2,9.9818111181747531E-3,9.8541157717830091E-3,9.7212302599507978E-3,9.5834376826112351E-3,9.4410009182736444E-3,9.2941643978326598E-3,9.1431556948798325E-3,8.9881869542886485E-3]
[null,null,null,null,null,null,null,null,null,null,null,null,null,null,null,15,0,1.5572390572390572E-3,2.8979635931507589E-3,4.0582593612896638E-3,5.0666151144620033E-3,5.9458218549127625E-3,6.7143294416021678E-3,7.3872332136794942E-3,7.9770032339202285E-3,8.4940312213039482E-3,8.947046219773493E-3,9.3434343434343429E-3,9.689487467265244E-3,9.9905986269622632E-3,1.0251416991228902E-2,1.0475971839608201E-2,1.0667772544605388E-2,1.0829889807162534E-2,1.0965022122046916E-2,1.1075550514053187E-2,1.1163583890856617E-2,1.1230996837057441E-2,1.1279461279461278E-2,1.1310473152578415E-2,1.1325374961738596E-2,1.1325374961738599E-2,1.1311563528858428E-2,1.1284927194018102E-2,1.124636071781949E-2,1.1196677518991569E-2,1.1136618712376286E-2,1.1066860968046736E-2,1.0988023367133618E-2,1.0900673400673399E-2,1.0805332233903661E-2,1.0702479338842974E-2,1.0592556581861395E-2,1.0475971839608201E-2,1.035310220558934E-2,1.0224296840458455E-2,1.0089879511367113E-2,9.9501508592417676E-3,9.8053904273999962E-3,9.6558584803098906E-3,9.5017976373908564E-3,9.3434343434343429E-3]
[null,null,null,null,null,null,null,null,null,null,null,null,null,null,null,16,0,1.5422195814352678E-3,2.8799782335135874E-3,4.0455592608702661E-3,5.0647893072135498E-3,5.9585756555453522E-3,6.7440242646854224E-3,7.4352661440935481E-3,8.0440771349862255E-3,8.5803489439853081E-3,9.0524514766939027E-3,9.4675146526998384E-3,9.8316498316498319E-3,1.015012542703243E-2,1.0427507397204366E-2,1.0667772544605388E-2,1.087440057137027E-2,1.1050449397556835E-2,1.1198617187922002E-2,1.1321293745536171E-2,1.1420603339795259E-2,1.1498440589349681E-2,1.1556500679307698E-2,1.1596304929638262E-2,1.1619222528313437E-2,1.1626489083990934E-2,1.1619222528313438E-2,1.1598436799282465E-2,1.1565053658717572E-2,1.1519912934054351E-2,1.1463781424255731E-2,1.1397360668798451E-2,1.1321293745536171E-2,1.1236171236171237E-2,1.1142536475869809E-2,1.1040890185275215E-2,1.0931694568058205E-2,1.0815376944593641E-2,1.0692332981895271E-2,1.0562929571194033E-2,1.0427507397204367E-2,1.028638323694145E-2,1.0139852020729763E-2,9.98818868361755E-3,9.8316498316498319E-3,9.670475244245736E-3]
[null,null,null,null,null,null,null,null,null,null,null,null,null,null,null,17,0,1.5263748597081931E-3,2.8592141510801802E-3,4.0275482093663911E-3,5.0548777821505086E-3,5.9604307538191825E-3,6.7600910288657329E-3,7.467095194367921E-3,8.0925619834710735E-3,8.6458995549904653E-3,9.1351222664353988E-3,9.5670995670995677E-3,9.9477533960292564E-3,1.0282216100397918E-2,1.0574957789034035E-2,1.0829889807162534E-2,{"$f":"IFERROR((VLOOKUP($P76,$D$15:$E$60,2,FALSE)*VLOOKUP(AG$8,$B$15:$C$60,2,FALSE))/($P76+AG$58),0)","v":1.1050449397556835E-2},1.1239669421487603E-2,1.1400236127508855E-2,1.1534537292113048E-2,1.1644702553793464E-2,1.1732637378570393E-2,1.18000518000518E-2,1.1848484848484848E-2,1.1879325404824295E-2,1.1893830075648258E-2,1.1893138573899674E-2,1.1878287002253945E-2,1.185021936537088E-2,1.180979758054857E-2,1.1757810210421426E-2,1.1694980104071011E-2,1.1621971102490584E-2,1.1539393939393938E-2,1.1447811447811448E-2,1.1347743165924986E-2,1.1239669421487604E-2,1.1124034962418802E-2,1.1001252191334836E-2,1.0871704053522236E-2,1.0735746620914083E-2,1.0593711408758429E-2,1.0445907456693279E-2,1.0292623201714111E-2,1.0134128166915052E-2,9.9706744868035182E-3]
[null,null,null,null,null,null,null,null,null,null,null,null,null,null,null,18,0,1.5098351940457206E-3,2.8360881542699732E-3,4.0049849140758233E-3,5.0379831371566907E-3,5.952808719607139E-3,6.7642332415059694E-3,7.4846648301193754E-3,8.1246026700572162E-3,8.6929905111723296E-3,9.1974944247671525E-3,9.6447230929989566E-3,1.0040404040404042E-2,1.0389525756094673E-2,1.0696453168044077E-2,1.0965022122046916E-2,1.1198617187922002E-2,1.1400236127508855E-2,1.1572543617998164E-2,1.171791626337081E-2,1.1838480498767581E-2,1.1936144663417391E-2,1.2012626262626263E-2,1.2069475240206948E-2,1.2108093926275744E-2,1.212975420163581E-2,1.2135612321562737E-2,1.2126721763085399E-2,1.2104044396534515E-2,1.2068460230936055E-2,1.2020775941230487E-2,1.1961732351342741E-2,1.1892011019283747E-2,1.1812240047534167E-2,1.1722999222999223E-2,1.1624824575081866E-2,1.1518212427303338E-2,1.1403623006928792E-2,1.1281483667847304E-2,1.1152191774201344E-2,1.1016117285709762E-2,1.0873605080076575E-2,1.0724977043158862E-2,1.0570533953544388E-2,1.0410557184750735E-2,1.0245310245310247E-2]
[null,null,null,null,null,null,null,null,null,null,null,null,null,null,null,19,0,1.4927048260381594E-3,2.8109376594225082E-3,3.9784901355149295E-3,5.0150162139621949E-3,5.9368941944699513E-3,6.7578818487909397E-3,7.4896203684082464E-3,8.1420263238445052E-3,8.7235996326905426E-3,9.2416678101108606E-3,9.7025813692480367E-3,1.0111871402193983E-2,1.0474377614529129E-2,1.0794353080854458E-2,1.1075550514053187E-2,1.1321293745536171E-2,1.1534537292113048E-2,1.171791626337081E-2,1.1873788388939904E-2,1.2004269580027156E-2,1.2111264156718701E-2,1.2196490651775204E-2,1.2261503928170594E-2,1.2307714210462624E-2,1.2336403520976525E-2,1.23487399244975E-2,1.2345789914959875E-2,1.2328529220856751E-2,1.2297852259973473E-2,1.2254580436398616E-2,1.2199469441893684E-2,1.2133215698278087E-2,1.2056462056462056E-2,1.1969802850305994E-2,1.1873788388939906E-2,1.1768928959011604E-2,1.165569839812264E-2,1.153453729211305E-2,1.1405855841592519E-2,1.1270036436959908E-2,1.1127435975920825E-2,1.0978387953052631E-2,1.0823204347153517E-2,1.0662177328843996E-2,1.0495580808080808E-2]
[null,null,null,null,null,null,null,null,null,null,null,null,null,null,null,20,0,1.4750681417348085E-3,2.7840387344519584E-3,3.9485766758494039E-3,4.986736047342108E-3,5.9136822773186402E-3,6.742247651338561E-3,7.4833633756192681E-3,8.1463990554899654E-3,8.7394319369240997E-3,9.2694622997653315E-3,9.7425871619420019E-3,1.0164141414141415E-2,1.0538813293634231E-2,1.0870739480365149E-2,1.1163583890856617E-2,1.1420603339795259E-2,1.1644702553793464E-2,1.1838480498767581E-2,1.2004269580027156E-2,1.2144168962350783E-2,1.2260073013953281E-2,1.2353695687029022E-2,1.2426591496358939E-2,1.2480173637198432E-2,1.2515729687446863E-2,1.2534435261707989E-2,1.2537365922278883E-2,1.2525507601265176E-2,1.2499765746518995E-2,1.2460973370064278E-2,1.2409898149648596E-2,1.2347248710885076E-2,1.2273680198208502E-2,1.2189799226836264E-2,1.2096168294515404E-2,1.199330972058245E-2,1.1881709170385408E-2,1.1761818815110351E-2,1.1634060170269725E-2,1.1498826650341801E-2,1.1356485872134158E-2,1.1207381735240975E-2,1.1051836304361559E-2,1.0890151515151516E-2,1.0722610722610723E-2]
[null,null,null,null,null,null,null,null,null,null,null,null,null,null,null,21,0,1.4569941842669117E-3,2.7556194354613327E-3,3.9156718702173252E-3,4.953780226507499E-3,5.884014974924065E-3,6.7183620718974258E-3,7.4670951943679202E-3,8.139070960387575E-3,8.7419651056014694E-3,9.2824629481520985E-3,9.7664141414141419E-3,1.0198959289868382E-2,1.0584634220997856E-2,1.0927456382001835E-2,1.1230996837057441E-2,1.1498440589349681E-2,1.1732637378570393E-2,1.1936144663417391E-2,1.2111264156718701E-2,1.2260073013953281E-2,1.2384450566268749E-2,1.2486101323310626E-2,1.2566574839302109E-2,1.2627282930313233E-2,1.2669514645799233E-2,1.2694449328878728E-2,1.2703168044077133E-2,1.2696663605754515E-2,1.2675849403122132E-2,1.2641567187021731E-2,1.2594593958230323E-2,1.2535648075956824E-2,1.2465394687616911E-2,1.2384450566268749E-2,1.2293388429752066E-2,1.2192740805180999E-2,1.2083003493661801E-2,1.1964638682666418E-2,1.1838077747168656E-2,1.1703723775258796E-2,1.1561953849343878E-2,1.1413121110090808E-2,1.1257556626874809E-2,1.1095571095571095E-2,1.0927456382001837E-2]
[null,null,null,null,null,null,null,null,null,null,null,null,null,null,null,22,0,1.438539989264627E-3,2.725869809203143E-3,3.8801346801346803E-3,4.916688250021584E-3,5.8486095523132553E-3,6.6871091871091876E-3,7.4418514648399705E-3,8.1212121212121211E-3,8.7324861518409905E-3,9.2820566778900118E-3,9.7755331088664431E-3,1.0217864923747278E-2,1.061343594676928E-2,1.0966142910587355E-2,1.1279461279461278E-2,1.1556500679307698E-2,1.18000518000518E-2,1.2012626262626263E-2,1.2196490651775204E-2,1.2353695687029022E-2,1.2486101323310626E-2,1.2595398428731763E-2,1.2683127572016459E-2,1.2750695359391013E-2,1.279938868591351E-2,1.2830387205387206E-2,1.2844774273345702E-2,1.2843546576879909E-2,1.2827622631544203E-2,1.2797850297850298E-2,1.2755013446837346E-2,1.2699837885023071E-2,1.2632996632996635E-2,1.2555114638447971E-2,1.2466772993088784E-2,1.23685127133403E-2,1.2260838136544352E-2,1.214421997755331E-2,1.2019098084671857E-2,1.1885883928894682E-2,1.1744962856073966E-2,1.1596696127946128E-2,1.144142277475611E-2,1.127946127946128E-2,1.1111111111111112E-2]
[null,null,null,null,null,null,null,null,null,null,null,null,null,null,null,23,0,{"$f":"IFERROR((VLOOKUP($P82,$D$15:$E$60,2,FALSE)*VLOOKUP(R$8,$B$15:$C$60,2,FALSE))/($P82+R$58),0)","v":1.4197530864197532E-3},2.6949494949494949E-3,3.8422688422688417E-3,4.8759196907345046E-3,5.8080808080808064E-3,6.6492511320097522E-3,7.4085297418630741E-3,8.0938416422287399E-3,8.712121212121211E-3,9.2694622997653298E-3,9.7712418300653584E-3,1.0222222222222221E-2,1.0626636737747849E-2,1.0988260988260987E-2,1.1310473152578415E-2,1.1596304929638262E-2,1.1848484848484848E-2,1.2069475240206948E-2,1.2261503928170594E-2,1.2426591496358939E-2,1.2566574839302109E-2,1.2683127572016459E-2,1.2777777777777777E-2,1.285192349022136E-2,1.2906846240179575E-2,1.2943722943722941E-2,1.2963636363636361E-2,1.296758434013336E-2,1.2956487956487957E-2,1.2931198780255381E-2,1.2892505299912706E-2,1.2841138659320477E-2,1.2777777777777777E-2,1.2703053931124106E-2,1.261755485893417E-2,1.2521828454031844E-2,1.241638608305275E-2,1.2301705580394104E-2,1.21782339524275E-2,1.20463898241676E-2,1.1906565656565655E-2,1.1759129759129759E-2,1.1604428119579636E-2,1.1442786069651741E-2,1.1274509803921568E-2]
[null,null,null,null,null,null,null,null,null,null,null,null,null,null,null,24,0,1.4006734006734006E-3,2.6629935720844816E-3,3.8023330952623884E-3,4.8318684682321037E-3,5.7629587410151671E-3,6.6054484236302419E-3,7.367911766738745E-3,8.057851239669421E-3,8.6818599215293425E-3,9.2457552350600474E-3,9.7546897546897538E-3,1.021324354657688E-2,1.0625501534592444E-2,1.0995118650621041E-2,1.1325374961738596E-2,1.1619222528313437E-2,1.1879325404824295E-2,1.2108093926275744E-2,1.2307714210462624E-2,1.2480173637198432E-2,1.2627282930313233E-2,1.2750695359391013E-2,1.285192349022136E-2,1.293235384144475E-2,1.2993259746506501E-2,1.3035812672176308E-2,1.3061092205477232E-2,1.3070094888276707E-2,1.3063742051735192E-2,1.3042886780260514E-2,1.3008320115758131E-2,1.2960776597140233E-2,1.2900939216728689E-2,1.2829443863926622E-2,1.2746883316991177E-2,1.2653810835629019E-2,1.2550743400221789E-2,1.2438164637578127E-2,1.2316527468042619E-2,1.218625650443832E-2,1.2047750229568411E-2,1.1901382975763141E-2,1.1747506727153948E-2,1.158645276292335E-2,1.1418533157663592E-2]
[null,null,null,null,null,null,null,null,null,null,null,null,null,null,null,25,0,1.3813347146680482E-3,2.6301171082315868E-3,3.7605492150946701E-3,4.7848741683642424E-3,5.713702683399653E-3,6.5562763509977593E-3,7.3206815631058058E-3,8.0140245429501638E-3,8.6425754874952746E-3,9.2118879997667904E-3,9.7268986157875072E-3,1.0192010192010194E-2,1.0611162126313642E-2,1.0987889775768565E-2,1.1325374961738599E-2,1.1626489083990934E-2,1.1893830075648258E-2,1.212975420163581E-2,1.2336403520976525E-2,1.2515729687446863E-2,1.2669514645799233E-2,1.279938868591351E-2,1.2906846240179575E-2,1.2993259746506501E-2,1.3059891847770639E-2,1.3107906156034499E-2,1.3138376774740414E-2,1.3152296742919957E-2,1.3150585541157934E-2,1.3134095778723879E-2,1.3103619164225226E-2,1.3059891847770639E-2,1.3003599210495764E-2,1.2935380167018586E-2,1.2855831037649222E-2,1.2765509039726628E-2,1.2664935441084026E-2,1.2554598413184273E-2,1.24349556167738E-2,1.2306436548860792E-2,1.216944467633173E-2,1.2024359378497778E-2,1.1871537718240038E-2,1.1711316059142147E-2,1.1544011544011546E-2]
[null,null,null,null,null,null,null,null,null,null,null,null,null,null,null,26,0,1.3617658062102507E-3,2.5964187327823696E-3,3.7171083879547835E-3,4.7352310988674623E-3,5.6607126988358651E-3,6.5022382920110191E-3,7.2674402426468531E-3,7.9630529897909575E-3,8.5950413223140499E-3,9.1687072747678802E-3,9.6887796887796893E-3,1.0159489633173844E-2,1.0584634220997856E-2,1.0967630853994489E-2,1.1311563528858428E-2,1.1619222528313438E-2,1.1893138573899674E-2,1.2135612321562737E-2,1.23487399244975E-2,1.2534435261707989E-2,1.2694449328878728E-2,1.2830387205387206E-2,1.2943722943722941E-2,1.3035812672176308E-2,1.3107906156034499E-2,1.3161157024793388E-2,1.3196631841571807E-2,1.3215318164813115E-2,1.3218131730528427E-2,1.3205922865013773E-2,1.3179482222544423E-2,1.3139545929514582E-2,1.3086800205444274E-2,1.3021885521885521E-2,1.2945400352255792E-2,1.2857904558784326E-2,1.2759922456892154E-2,1.2651945592286501E-2,1.253443526170799E-2,1.2407824804519019E-2,1.2272521689075284E-2,1.2128909415005672E-2,1.1977349250076524E-2,1.1818181818181818E-2,1.1651728553137003E-2]
[null,null,null,null,null,null,null,null,null,null,null,null,null,null,null,27,0,1.341991341991342E-3,2.5619834710743808E-3,3.672176308539945E-3,4.6831955922865013E-3,5.6043388429752056E-3,6.4437766090658655E-3,7.2087181980230106E-3,7.905548996458088E-3,8.5399449035812661E-3,9.1169682078773E-3,9.6411483253588531E-3,1.0116550116550117E-2,1.0546831955922865E-2,1.0935295303366257E-2,1.1284927194018102E-2,1.1598436799282465E-2,1.1878287002253945E-2,1.2126721763085399E-2,1.2345789914959875E-2,1.2537365922278883E-2,1.2703168044077133E-2,1.2844774273345702E-2,1.2963636363636361E-2,1.3061092205477232E-2,1.3138376774740414E-2,1.3196631841571807E-2,1.3236914600550964E-2,1.3260205359378913E-2,1.3267414403778042E-2,1.3259388139770914E-2,1.3236914600550964E-2,1.32007283933324E-2,1.3151515151515152E-2,1.3089915548931942E-2,1.3016528925619835E-2,1.2931916568280206E-2,1.2836604683195594E-2,1.2731087094723459E-2,1.2615827698472328E-2,1.2491262694790509E-2,1.2357802625182305E-2,1.2215834231644507E-2,1.2065722156631249E-2,1.1907810499359794E-2,1.1742424242424242E-2]
[null,null,null,null,null,null,null,null,null,null,null,null,null,null,null,28,0,1.3220325864004027E-3,2.526885011733497E-3,3.6258972915864411E-3,4.6289919395979999E-3,5.5448887404810259E-3,6.3812816219233331E-3,7.1449852055912649E-3,7.8420569329660239E-3,8.4778993869902963E-3,9.0573464576654376E-3,9.5847362514029175E-3,1.0063973063973063E-2,1.0498580284241778E-2,1.0891745740230588E-2,1.124636071781949E-2,1.1565053658717572E-2,1.185021936537088E-2,1.2104044396534515E-2,1.2328529220856751E-2,1.2525507601265176E-2,1.2696663605754515E-2,1.2843546576879909E-2,1.296758434013336E-2,1.3070094888276707E-2,1.3152296742919957E-2,1.3215318164813115E-2,1.3260205359378913E-2,1.3287929803081317E-2,1.3299394798597352E-2,1.3295441351867682E-2,{"$f":"IFERROR((VLOOKUP($P87,$D$15:$E$60,2,FALSE)*VLOOKUP(AV$8,$B$15:$C$60,2,FALSE))/($P87+AV$58),0)","v":1.3276853451481083E-2},1.3244362820120396E-2,1.3198653198653199E-2,1.3140364215633032E-2,1.3070094888276707E-2,1.2988406795224979E-2,1.2895826956433019E-2,1.2792850451252655E-2,1.2679942802059491E-2,1.2557542147559973E-2,1.2426061227115245E-2,1.2285889194980104E-2,1.2137393281225975E-2,1.1980920314253648E-2,1.181679811816798E-2]
[null,null,null,null,null,null,null,null,null,null,null,null,null,null,null,29,0,1.3019079685746354E-3,2.4911875351758058E-3,3.5783976124885222E-3,4.5728172449935539E-3,5.4826338248798144E-3,6.3150990423717704E-3,7.0766588443356114E-3,7.7730623185168646E-3,8.4094533855299421E-3,8.9904483843877801E-3,9.5202020202020225E-3,1.0002463661000247E-2,1.0440625592140745E-2,1.0837764537553122E-2,1.1196677518991569E-2,1.1519912934054351E-2,1.180979758054857E-2,1.2068460230936055E-2,1.2297852259973473E-2,1.2499765746518995E-2,1.2675849403122132E-2,1.2827622631544203E-2,1.2956487956487957E-2,1.3063742051735192E-2,1.3150585541157934E-2,1.3218131730528427E-2,1.3267414403778042E-2,1.3299394798597352E-2,1.3314967860422409E-2,1.3314967860422406E-2,1.3300173451688603E-2,1.3271312228093154E-2,1.3229064841968069E-2,1.3174068729624285E-2,1.3106921487603307E-2,1.3028183937274848E-2,1.2938382910834703E-2,1.2838013787810262E-2,1.2727542807756714E-2,1.2607409181849235E-2,1.247802702348157E-2,1.2339787115715413E-2,1.2193058531442372E-2,1.2038190120381903E-2,1.1875511875511877E-2]
[null,null,null,null,null,null,null,null,null,null,null,null,null,null,null,30,0,1.2816335396980557E-3,2.454947199265381E-3,3.5297882405320416E-3,4.5148454239363322E-3,5.4178145087235979E-3,6.2455361697785934E-3,7.0041115495660927E-3,7.6989995650282713E-3,8.3350992441901528E-3,8.9168197122742564E-3,9.4481399359448125E-3,9.9326599326599319E-3,1.0373644834532783E-2,1.0774062943484429E-2,1.1136618712376286E-2,1.1463781424255731E-2,1.1757810210421426E-2,1.2020775941230487E-2,1.2254580436398616E-2,1.2460973370064278E-2,1.2641567187021731E-2,1.2797850297850298E-2,1.2931198780255381E-2,1.3042886780260514E-2,1.3134095778723879E-2,1.3205922865013773E-2,1.3259388139770914E-2,1.3295441351867682E-2,1.3314967860422406E-2,1.3318794000612179E-2,1.3307691921700861E-2,1.328238395687076E-2,1.3243546576879909E-2,1.3191813973063972E-2,1.312778130959949E-2,1.3052007680106854E-2,1.2965018799482843E-2,1.2867309458218547E-2,1.2759345763298331E-2,1.2641567187021729E-2,1.2514388442685495E-2,1.2378201203958779E-2,1.2233375682939817E-2,1.2080262080262078E-2,1.1919191919191918E-2]
[null,null,null,null,null,null,null,null,null,null,null,null,null,null,null,31,0,1.2612233445566778E-3,2.4182133548524736E-3,3.4801670897927585E-3,4.4552305158365767E-3,5.3506444920586324E-3,6.172867081957991E-3,6.9276765528759141E-3,7.620258529349438E-3,8.2552800734618913E-3,8.8369529241665232E-3,9.3690877024210362E-3,9.855140552814971E-3,1.0298253424975187E-2,1.0701288984117265E-2,1.1066860968046736E-2,1.1397360668798451E-2,1.1694980104071011E-2,1.1961732351342741E-2,1.2199469441893684E-2,1.2409898149648596E-2,1.2594593958230323E-2,1.2755013446837346E-2,1.2892505299912706E-2,1.3008320115758131E-2,1.3103619164225226E-2,1.3179482222544423E-2,1.3236914600550964E-2,1.3276853451481083E-2,1.3300173451688603E-2,1.3307691921700861E-2,1.3300173451688602E-2,1.3278334086414894E-2,1.3242845117845117E-2,1.319433652766986E-2,1.3133400116871191E-2,1.3060592355029262E-2,1.297643697821951E-2,1.2881427361005754E-2,1.2776028685119595E-2,1.2660679924871132E-2,1.2535795667108798E-2,1.2401767781593435E-2,1.2258966955936654E-2,1.2107744107744107E-2,1.194843168527379E-2]
[null,null,null,null,null,null,null,null,null,null,null,null,null,null,null,32,0,1.2406897255382106E-3,2.3810295468049483E-3,3.4296208841663391E-3,4.3941094446144947E-3,5.2813143722234635E-3,6.0973370064279159E-3,6.8476529082589681E-3,7.5371900826446282E-3,8.1703957535443142E-3,8.7512935997784494E-3,9.2835330044632371E-3,9.7704315886134076E-3,1.0215012073597932E-2,1.0620034335449354E-2,1.0988023367133618E-2,1.1321293745536171E-2,1.1621971102490584E-2,1.1892011019283747E-2,1.2133215698278087E-2,1.2347248710885076E-2,1.2535648075956824E-2,1.2699837885023071E-2,1.2841138659320477E-2,1.2960776597140233E-2,1.3059891847770639E-2,1.3139545929514582E-2,1.32007283933324E-2,1.3244362820120396E-2,1.3271312228093154E-2,1.328238395687076E-2,1.3278334086414894E-2,1.3259871441689625E-2,1.3227661227661228E-2,1.3182328333843486E-2,1.3124460342913534E-2,1.3054610273861612E-2,1.297329908660607E-2,1.2881017971927063E-2,1.277823044788474E-2,1.2665374281535897E-2,1.2542863252701359E-2,1.2411088774725139E-2,1.2270421385572902E-2,1.2121212121212121E-2,1.1963793781975601E-2]
[null,null,null,null,null,null,null,null,null,null,null,null,null,null,null,33,0,1.2200435729847494E-3,2.343434343434344E-3,3.3782267115600451E-3,4.331604331604331E-3,5.2099946836788938E-3,6.0191660191660197E-3,6.7643097643097644E-3,7.4501108647450119E-3,8.0808080808080808E-3,8.660245869548196E-3,9.1919191919191921E-3,9.6790123456790122E-3,1.0124432733128385E-2,1.053084031807436E-2,1.0900673400673399E-2,1.1236171236171237E-2,1.1539393939393938E-2,1.1812240047534167E-2,1.2056462056462056E-2,1.2273680198208502E-2,1.2465394687616911E-2,1.2632996632996635E-2,1.2777777777777777E-2,1.2900939216728689E-2,1.3003599210495764E-2,1.3086800205444274E-2,1.3151515151515152E-2,1.3198653198653199E-2,1.3229064841968069E-2,1.3243546576879909E-2,1.3242845117845117E-2,1.3227661227661228E-2,1.3198653198653199E-2,1.3156440022111663E-2,1.3101604278074868E-2,1.303469477382521E-2,1.2956228956228957E-2,1.2866695120216248E-2,1.2766554433221101E-2,1.2656242793229095E-2,1.2536172536172535E-2,1.2406734006734007E-2,1.2268297005139112E-2,1.2121212121212121E-2,1.1965811965811967E-2]
[null,null,null,null,null,null,null,null,null,null,null,null,null,null,null,34,0,1.1992945326278659E-3,2.3054620276842502E-3,3.3260533260533261E-3,4.267824443263039E-3,5.1368384701718029E-3,5.9385521885521892E-3,6.677890011223344E-3,7.3593073593073589E-3,7.9868451961475212E-3,8.5641771247831847E-3,9.094650205761317E-3,9.5813204508856682E-3,1.0026983785849033E-2,1.0434203142536473E-2,1.0805332233903661E-2,{"$f":"IFERROR((VLOOKUP($P93,$D$15:$E$60,2,FALSE)*VLOOKUP(AG$8,$B$15:$C$60,2,FALSE))/($P93+AG$58),0)","v":1.1142536475869809E-2},1.1447811447811448E-2,1.1722999222999223E-2,1.1969802850305994E-2,1.2189799226836264E-2,1.2384450566268749E-2,1.2555114638447971E-2,1.2703053931124106E-2,1.2829443863926622E-2,1.2935380167018586E-2,1.3021885521885521E-2,1.3089915548931942E-2,1.3140364215633032E-2,1.3174068729624285E-2,1.3191813973063972E-2,1.319433652766986E-2,1.3182328333843486E-2,1.3156440022111663E-2,1.3117283950617283E-2,1.3065436978480456E-2,1.3001443001443003E-2,1.2925815273233113E-2,1.2839038533482977E-2,1.2741570960749043E-2,1.26338459671793E-2,1.2516273849607181E-2,1.2389243310295941E-2,1.2253122859183466E-2,1.2108262108262107E-2,1.1954992967651195E-2]
[null,null,null,null,null,null,null,null,null,null,null,null,null,null,null,35,0,1.1784511784511786E-3,2.267143176234086E-3,3.2731622444541106E-3,4.202867839231475E-3,5.06198347107438E-3,5.8556742592219312E-3,6.5886134067952244E-3,7.2650394003459543E-3,7.888805409466567E-3,8.4634220997857369E-3,8.9920948616600809E-3,9.4777562862669255E-3,9.9230945821854911E-3,1.0330578512396695E-2,1.0702479338842974E-2,1.1040890185275215E-2,1.1347743165924986E-2,1.1624824575081866E-2,1.1873788388939906E-2,1.2096168294515404E-2,1.2293388429752066E-2,1.2466772993088784E-2,1.261755485893417E-2,1.2746883316991177E-2,1.2855831037649222E-2,1.2945400352255792E-2,1.3016528925619835E-2,1.3070094888276707E-2,1.3106921487603307E-2,1.312778130959949E-2,1.3133400116871191E-2,1.3124460342913534E-2,1.3101604278074868E-2,1.3065436978480456E-2,1.3016528925619837E-2,1.2955418461180306E-2,1.2882614018977657E-2,1.2798596173440507E-2,1.2703819522001341E-2,1.2598714416896235E-2,1.2483688560243584E-2,1.2359128474830955E-2,1.2225400861764501E-2,1.2082853855005755E-2,1.1931818181818182E-2]
[null,null,null,null,null,null,null,null,null,null,null,null,null,null,null,36,0,1.1575211575211577E-3,2.2285051471654348E-3,3.2196086741541293E-3,4.1368227731864099E-3,4.9855539877712825E-3,5.7706939525121355E-3,6.4966792662352925E-3,7.1675432006010533E-3,7.7869605142332418E-3,8.3582864215275294E-3,8.8845905867182481E-3,9.36868686868687E-3,9.8131594235490345E-3,1.022038567493113E-2,1.0592556581861395E-2,1.0931694568058205E-2,1.1239669421487604E-2,1.1518212427303338E-2,1.1768928959011604E-2,1.199330972058245E-2,1.2192740805180999E-2,1.23685127133403E-2,1.2521828454031844E-2,1.2653810835629019E-2,1.2765509039726628E-2,1.2857904558784326E-2,1.2931916568280206E-2,1.2988406795224979E-2,1.3028183937274848E-2,1.3052007680106854E-2,1.3060592355029262E-2,1.3054610273861612E-2,1.303469477382521E-2,1.3001443001443003E-2,1.2955418461180306E-2,1.2897153351698809E-2,1.2827150710089691E-2,1.274588638225002E-2,1.2653810835629019E-2,1.255135082886279E-2,1.2438910951307646E-2,1.2316875044147774E-2,1.2185607513570692E-2,1.2045454545454547E-2,1.1896745230078564E-2]
[null,null,null,null,null,null,null,null,null,null,null,null,null,null,null,37,0,1.1365113119499084E-3,2.1895724926027957E-3,3.165442301805938E-3,4.0697688886898054E-3,4.9076624834200593E-3,5.6837579459143948E-3,6.4022687851888948E-3,7.0670339761248853E-3,7.6815586697009629E-3,8.2490497061741431E-3,8.7724466891133564E-3,9.2544492544492547E-3,9.6975410672380368E-3,1.0104010995276594E-2,1.0475971839608201E-2,1.0815376944593641E-2,1.1124034962418802E-2,1.1403623006928792E-2,1.165569839812264E-2,1.1881709170385408E-2,1.2083003493661801E-2,1.2260838136544352E-2,1.241638608305275E-2,1.2550743400221789E-2,1.2664935441084026E-2,1.2759922456892154E-2,1.2836604683195594E-2,1.2895826956433019E-2,1.2938382910834703E-2,1.2965018799482843E-2,1.297643697821951E-2,1.297329908660607E-2,1.2956228956228957E-2,1.2925815273233113E-2,1.2882614018977657E-2,1.2827150710089691E-2,1.2759922456892154E-2,1.2681399857157433E-2,1.2592028740354101E-2,1.2492231775978331E-2,1.2382409958167534E-2,1.2262943977558477E-2,1.2134195490256098E-2,1.1996508292804589E-2,1.1850209411185022E-2]
[null,null,null,null,null,null,null,null,null,null,null,null,null,null,null,38,0,1.1154277820944487E-3,2.1503673094582188E-3,3.1107079665837981E-3,4.0017782442024865E-3,4.8284109594891834E-3,5.5949995826028885E-3,6.3055470530217995E-3,6.963708228530362E-3,7.5728269151866838E-3,8.1359682685440259E-3,8.6559472273757994E-3,9.1353535353535346E-3,9.5765738189980618E-3,9.9818111181747531E-3,1.035310220558934E-2,1.0692332981895271E-2,1.1001252191334836E-2,1.1281483667847304E-2,1.153453729211305E-2,1.1761818815110351E-2,1.1964638682666418E-2,1.214421997755331E-2,1.2301705580394104E-2,1.2438164637578127E-2,1.2554598413184273E-2,1.2651945592286501E-2,1.2731087094723459E-2,1.2792850451252655E-2,1.2838013787810262E-2,1.2867309458218547E-2,1.2881427361005754E-2,1.2881017971927063E-2,1.2866695120216248E-2,1.2839038533482977E-2,1.2798596173440507E-2,1.274588638225002E-2,1.2681399857157433E-2,1.2605601469237832E-2,1.2518931940419543E-2,1.2421809391506361E-2,1.231463077262847E-2,1.219777318640955E-2,1.2071595113121489E-2,1.1936437546193644E-2,1.1792625045637094E-2]
[null,null,null,null,null,null,null,null,null,null,null,null,null,null,null,39,0,1.0942760942760942E-3,2.1109095388474552E-3,3.0554462372644189E-3,3.9329161950726428E-3,4.7478921445863595E-3,5.5045403530252024E-3,6.2066648035027485E-3,6.8577457358888691E-3,7.4609733700642797E-3,8.0192774997969816E-3,8.5353535353535365E-3,9.0116854822737177E-3,9.4505662687480868E-3,9.8541157717830091E-3,1.0224296840458455E-2,1.0562929571194033E-2,1.0871704053522236E-2,1.1152191774201344E-2,1.1405855841592519E-2,1.1634060170269725E-2,1.1838077747168656E-2,1.2019098084671857E-2,1.21782339524275E-2,1.2316527468042619E-2,1.24349556167738E-2,1.253443526170799E-2,1.2615827698472328E-2,1.2679942802059491E-2,1.2727542807756714E-2,1.2759345763298331E-2,1.2776028685119595E-2,1.277823044788474E-2,1.2766554433221101E-2,1.2741570960749043E-2,1.2703819522001341E-2,1.2653810835629019E-2,1.2592028740354101E-2,1.2518931940419543E-2,1.2434955616773798E-2,1.2340512915886909E-2,1.2235996326905417E-2,1.2121778956795792E-2,1.1998215712184672E-2,1.1865644395764877E-2,1.1724386724386724E-2]
[null,null,null,null,null,null,null,null,null,null,null,null,null,null,null,40,0,{"$f":"IFERROR((VLOOKUP($P99,$D$15:$E$60,2,FALSE)*VLOOKUP(R$8,$B$15:$C$60,2,FALSE))/($P99+R$58),0)","v":1.0730612356628618E-3},2.0712172227323744E-3,2.9996939087848177E-3,3.8632421552531743E-3,4.6661905247763827E-3,5.4124911832421716E-3,6.1057599419946278E-3,6.7493112947658402E-3,7.3461891643709825E-3,7.8991939598000212E-3,8.410906450122135E-3,8.8837088837088844E-3,9.319803716601887E-3,9.7212302599507978E-3,1.0089879511367113E-2,1.0427507397204367E-2,1.0735746620914083E-2,1.1016117285709762E-2,1.1270036436959908E-2,1.1498826650341801E-2,1.1703723775258796E-2,1.1885883928894682E-2,1.20463898241676E-2,1.218625650443832E-2,1.2306436548860792E-2,1.2407824804519019E-2,1.2491262694790509E-2,1.2557542147559973E-2,1.2607409181849235E-2,1.2641567187021729E-2,1.2660679924871132E-2,1.2665374281535897E-2,1.2656242793229095E-2,1.26338459671793E-2,1.2598714416896235E-2,1.255135082886279E-2,1.2492231775978331E-2,1.2421809391506361E-2,1.2340512915886909E-2,1.2248750127538005E-2,1.2146908667671853E-2,1.2035357268173232E-2,1.1914446890715602E-2,1.1784511784511783E-2,1.1645870469399881E-2]
[null,null,null,null,null,null,null,null,null,null,null,null,null,null,null,41,0,1.0517877184543852E-3,2.0313067247528138E-3,2.9434844310877368E-3,3.7928102574567224E-3,4.583383239509721E-3,5.3189535587988192E-3,6.002958881746759E-3,6.638556248945859E-3,7.2286501377410474E-3,7.7759172233325532E-3,8.2828282828282824E-3,8.7516676195921479E-3,9.1845503293314732E-3,9.5834376826112351E-3,9.9501508592417676E-3,1.028638323694145E-2,1.0593711408758429E-2,1.0873605080076575E-2,1.1127435975920825E-2,1.1356485872134158E-2,1.1561953849343878E-2,1.1744962856073966E-2,1.1906565656565655E-2,1.2047750229568411E-2,1.216944467633173E-2,1.2272521689075284E-2,1.2357802625182305E-2,1.2426061227115245E-2,1.247802702348157E-2,1.2514388442685495E-2,1.2535795667108798E-2,1.2542863252701359E-2,1.2536172536172535E-2,1.2516273849607181E-2,1.2483688560243584E-2,1.2438910951307646E-2,1.2382409958167534E-2,1.231463077262847E-2,1.2235996326905417E-2,1.2146908667671853E-2,1.2047750229568411E-2,1.1938885016650623E-2,1.1820659699447579E-2,1.1693404634581104E-2,1.1557434813248767E-2]
[null,null,null,null,null,null,null,null,null,null,null,null,null,null,null,42,0,1.030459635110798E-3,1.9911929209449871E-3,2.8868482807876752E-3,3.721669927203524E-3,4.4995408631772265E-3,5.2240205081114169E-3,5.8983777165595337E-3,6.525619834710744E-3,7.1085183384648623E-3,7.6496315132678766E-3,8.1513245664189063E-3,8.6157875046763942E-3,9.045051061579986E-3,9.4410009182736444E-3,9.8053904273999962E-3,1.0139852020729763E-2,1.0445907456693279E-2,1.0724977043158862E-2,1.0978387953052631E-2,1.1207381735240975E-2,1.1413121110090808E-2,1.1596696127946128E-2,1.1759129759129759E-2,1.1901382975763141E-2,1.2024359378497778E-2,1.2128909415005672E-2,1.2215834231644507E-2,1.2285889194980104E-2,1.2339787115715413E-2,1.2378201203958779E-2,1.2401767781593435E-2,1.2411088774725139E-2,1.2406734006734007E-2,1.2389243310295941E-2,1.2359128474830955E-2,1.2316875044147774E-2,1.2262943977558477E-2,1.219777318640955E-2,1.2121778956795792E-2,1.2035357268173232E-2,1.1938885016650623E-2,1.1832721150902968E-2,1.1717207727902917E-2,1.1592670894996476E-2,1.145942180424939E-2]
[null,null,null,null,null,null,null,null,null,null,null,null,null,null,null,43,0,1.0090807060504031E-3,1.9508893650307794E-3,2.8298132843587393E-3,3.6498663835865643E-3,4.414728088970513E-3,5.1277774654398039E-3,5.7921232527293129E-3,6.4106303678496202E-3,6.9859433495797147E-3,7.520507148866212E-3,8.0165856091782024E-3,8.4762779308233862E-3,8.9015333712303413E-3,9.2941643978326598E-3,9.6558584803098906E-3,9.98818868361755E-3,1.0292623201714111E-2,1.0570533953544388E-2,1.0823204347153517E-2,1.1051836304361559E-2,1.1257556626874809E-2,1.144142277475611E-2,1.1604428119579636E-2,1.1747506727153948E-2,1.1871537718240038E-2,1.1977349250076524E-2,1.2065722156631249E-2,1.2137393281225975E-2,1.2193058531442372E-2,1.2233375682939817E-2,1.2258966955936654E-2,1.2270421385572902E-2,1.2268297005139112E-2,1.2253122859183466E-2,1.2225400861764501E-2,1.2185607513570692E-2,1.2134195490256098E-2,1.2071595113121489E-2,1.1998215712184672E-2,1.1914446890715602E-2,1.1820659699447579E-2,1.1717207727902917E-2,1.1604428119579636E-2,1.1482642517125276E-2,1.1352157943067036E-2]
[null,null,null,null,null,null,null,null,null,null,null,null,null,null,null,44,0,9.8765432098765434E-4,1.9104084321475629E-3,2.7724049000644748E-3,3.5774410774410772E-3,4.3290043290043281E-3,5.0303030303030308E-3,5.6842939195880368E-3,6.2937062937062933E-3,6.8610634648370496E-3,7.3887018331462778E-3,7.8787878787878792E-3,8.3333333333333332E-3,8.7542087542087539E-3,9.1431556948798325E-3,9.5017976373908564E-3,9.8316498316498319E-3,1.0134128166915052E-2,1.0410557184750735E-2,1.0662177328843996E-2,1.0890151515151516E-2,1.1095571095571095E-2,1.127946127946128E-2,1.1442786069651741E-2,1.158645276292335E-2,1.1711316059142147E-2,1.1818181818181818E-2,1.1907810499359794E-2,1.1980920314253648E-2,1.2038190120381903E-2,1.2080262080262078E-2,1.2107744107744107E-2,1.2121212121212121E-2,1.2121212121212121E-2,1.2108262108262107E-2,1.2082853855005755E-2,1.2045454545454547E-2,1.1996508292804589E-2,1.1936437546193644E-2,1.1865644395764877E-2,1.1784511784511783E-2,1.1693404634581104E-2,1.1592670894996476E-2,1.1482642517125276E-2,1.1363636363636364E-2,1.1235955056179775E-2]
[null,null,null,null,null,null,null,null,null,null,null,null,null,null,null,45,0,9.6618357487922714E-4,1.8697614442295296E-3,2.7146464646464648E-3,3.5044320758606472E-3,4.242424242424242E-3,4.9316696375519909E-3,5.5749805749805747E-3,6.1749571183533445E-3,6.7340067340067346E-3,7.2543617998163459E-3,7.7380952380952384E-3,8.1871345029239772E-3,8.6032741205154997E-3,8.9881869542886485E-3,9.3434343434343429E-3,9.670475244245736E-3,9.9706744868035182E-3,1.0245310245310247E-2,1.0495580808080808E-2,1.0722610722610723E-2,1.0927456382001837E-2,1.1111111111111112E-2,1.1274509803921568E-2,1.1418533157663592E-2,1.1544011544011546E-2,1.1651728553137003E-2,1.1742424242424242E-2,1.181679811816798E-2,1.1875511875511877E-2,1.1919191919191918E-2,{"$f":"IFERROR((VLOOKUP($P104,$D$15:$E$60,2,FALSE)*VLOOKUP(AV$8,$B$15:$C$60,2,FALSE))/($P104+AV$58),0)","v":1.194843168527379E-2},1.1963793781975601E-2,1.1965811965811967E-2,1.1954992967651195E-2,1.1931818181818182E-2,1.1896745230078564E-2,1.1850209411185022E-2,1.1792625045637094E-2,1.1724386724386724E-2,1.1645870469399881E-2,1.1557434813248767E-2,1.145942180424939E-2,1.1352157943067036E-2,1.1235955056179775E-2,1.1111111111111112E-2]

{"sheet":"Ej. 4","index":3,"n_rows":65,"n_cols":52,"rows_kept":65,"cut":false,"hidden":false,"merged":[[38,14,64,14],[0,1,0,4],[12,1,12,2],[12,3,12,4],[4,14,4,46],[3,2,3,3],[0,6,0,8],[4,2,4,3],[6,2,6,3],[7,2,7,3],[9,2,9,3],[10,2,10,3],[1,6,2,6],[3,6,4,6],[6,14,32,14],[36,16,36,46],[35,14,35,46],[5,2,5,3]]}
[null,"Posibilidades de que te salga un tema que te sepas dependiendo del número de ellos que te sabes",null,null,null,null,"Simulador de sorteo"]
[null,"Temas parte A",19,"Temas parte B",17,null,"Temas parte A",{"$f":"_xlfn.RANK.EQ(AX7,$AX$7:$AX$36)","v":21},{"$f":"_xlfn.CONCAT(\"4.A.\",H2)","v":"4.A.21"},{"$f":"VLOOKUP(I2,ListadoDeTemas1[[Tema]:[Nombre del tema]],2,FALSE)","v":"Análisis de la evolución de la balanza de pagos y de la Posición de Inversión Internacional de España desde la adopción del euro. Posición neta del Banco de España frente al Eurosistema. La sostenibilidad externa."}]
[null,null,null,null,null,null,null,{"$f":"_xlfn.RANK.EQ(AX8,$AX$7:$AX$36)","v":9},{"$f":"_xlfn.CONCAT(\"4.A.\",H3)","v":"4.A.9"},{"$f":"VLOOKUP(I3,ListadoDeTemas1[[Tema]:[Nombre del tema]],2,FALSE)","v":"Análisis de la industria en España. Características y situación actual. Los retos de la industria y la política industrial en España en el contexto de las economías desarrolladas. La estrategia de la UE."}]
[null,null,"Probabilidad total",null,null,null,"Temas parte B",{"$f":"_xlfn.RANK.EQ(AZ7,$AZ$7:$AZ$32)","v":18},{"$f":"_xlfn.CONCAT(\"4.B.\",H4)","v":"4.B.18"},{"$f":"VLOOKUP(I4,ListadoDeTemas1[[Tema]:[Nombre del tema]],2,FALSE)","v":"Fiscalidad internacional. El Impuesto sobre la Renta de no Residentes en España. Convenios de doble imposición, con especial referencia al modelo de la OCDE. El problema de la erosión de bases imponibles y propuestas de solución."}]
[null,null,{"$f":"VLOOKUP($E$2,$P$6:$AU$33,$C$2+2,FALSE)","v":0.77679929266136161},null,null,null,null,{"$f":"_xlfn.RANK.EQ(AZ8,$AZ$7:$AZ$32)","v":14},{"$f":"_xlfn.CONCAT(\"4.B.\",H5)","v":"4.B.14"},{"$f":"VLOOKUP(I5,ListadoDeTemas1[[Tema]:[Nombre del tema]],2,FALSE)","v":"La teoría del federalismo fiscal: la asignación óptima de las funciones entre los distintos niveles de gobierno para alcanzar el bienestar máximo. La financiación de las haciendas territoriales: impuestos, transferencias y deuda."},null,null,null,null,"Probabilidad total"]
[null,null,{"$f":"IFERROR(_xlfn.IFS(IFERROR(VLOOKUP($E$2,$P$6:$AU$35,$C$2+2,FALSE)<VLOOKUP($E$2+1,$P$6:$AU$35,$C$2+1,FALSE),1=0),\"Cambiar un tema de la parte A por un tema de la parte B\",VLOOKUP($E$2,$P$6:$AU$35,$C$2+2,FALSE)<VLOOKUP($E$2-1,$P$6:$AU$35,$C$2+3,FALSE),\"Cambiar un tema de la parte B por un tema de la parte A\"),\"\")","v":""},null,null,null,null,null,null,null,null,null,null,null,null,null,0,1,2,3,4,5,6,7,8,9,10,11,12,13,14,15,16,17,18,19,20,21,22,23,24,25,26,27,28,29,30,null,null,"#A",null,"#B"]
[null,null,"Probabilidad por número de temas",null,null,null,null,null,null,null,null,null,null,null,"Temas que te sabes parte B",0,{"$f":"VLOOKUP($P7,$D$15:$E$41,2,FALSE)*VLOOKUP(Q$6,$B$15:$C$45,2,FALSE)","v":0},{"$f":"VLOOKUP($P7,$D$15:$E$41,2,FALSE)*VLOOKUP(R$6,$B$15:$C$45,2,FALSE)","v":0},0,0,0,0,0,0,0,0,0,0,0,0,0,0,0,0,0,0,0,0,0,0,0,0,0,0,0,0,0,null,1,{"$f":"RAND()","v":0.37528968997110812},1,{"$f":"RAND()","v":0.4690213122460779}]
[null,null,{"$f":"VLOOKUP($E$2,$P$38:$AU$65,$C$2+2,FALSE)","v":2.1577758129482268E-2},null,null,null,null,null,null,null,null,null,null,null,null,1,{"$f":"VLOOKUP($P8,$D$15:$E$41,2,FALSE)*VLOOKUP(Q$6,$B$15:$C$45,2,FALSE)","v":0},5.1282051282051282E-3,1.0079575596816975E-2,1.4854111405835544E-2,1.9451812555260833E-2,2.387267904509284E-2,2.8116710875331567E-2,3.2183908045977018E-2,3.6074270557029178E-2,3.9787798408488062E-2,4.3324491600353669E-2,4.6684350132626E-2,4.986737400530504E-2,5.2873563218390811E-2,5.5702917771883291E-2,5.8355437665782495E-2,6.0831122900088422E-2,6.3129973474801065E-2,6.5251989389920426E-2,6.7197170645446502E-2,6.8965517241379309E-2,7.0557029177718833E-2,7.1971706454465073E-2,7.3209549071618057E-2,7.4270557029177731E-2,7.515473032714412E-2,7.586206896551724E-2,7.6392572944297091E-2,7.6746242263483658E-2,7.6923076923076927E-2,7.6923076923076927E-2,null,2,{"$f":"RAND()","v":0.72928242475066474},2,0.6233434204805528]
[null,null,null,null,null,null,null,null,null,null,null,null,null,null,null,2,0,1.0051282051282051E-2,1.975596816976127E-2,2.9114058355437664E-2,3.8125552608311235E-2,4.6790450928381966E-2,5.5108753315649871E-2,6.3080459770114949E-2,7.0705570291777181E-2,7.7984084880636587E-2,8.4916003536693194E-2,9.1501326259946947E-2,9.7740053050397874E-2,0.10363218390804597,0.10917771883289125,0.11437665782493368,0.11922900088417329,0.12373474801061007,0.12789389920424404,0.13170645446507515,0.13517241379310344,0.13829177718832891,0.14106454465075155,0.14349071618037137,0.14557029177718833,0.14730327144120248,0.14868965517241378,0.14972944297082227,0.15042263483642795,0.15076923076923077,0.15076923076923077,null,3,0.4253420935920792,3,0.96071711331014831]
[null,null,"Nivel de eficiencia",null,null,null,null,null,null,null,null,null,null,null,null,3,0,1.4769230769230767E-2,2.9029177718832885E-2,4.2779840848806358E-2,5.6021220159151196E-2,6.8753315649867364E-2,8.0976127320954897E-2,9.2689655172413787E-2,0.10389389920424401,0.1145888594164456,0.12477453580901855,0.13445092838196285,0.14361803713527849,0.15227586206896551,0.16042440318302387,0.16806366047745355,0.17519363395225462,0.18181432360742703,0.18792572944297081,0.1935278514588859,0.19862068965517241,0.20320424403183021,0.20727851458885937,0.21084350132625995,0.21389920424403183,0.21644562334217504,0.21848275862068964,0.22001061007957556,0.22102917771883288,0.22153846153846152,0.22153846153846152,null,4,9.1197189726126782E-2,4,0.25148897175325502]
[null,null,{"$f":"C8/MAX(Q39:AU65)","v":1},null,null,null,null,null,null,null,null,null,null,null,null,4,0,1.9282051282051283E-2,3.7899204244031828E-2,5.5851458885941646E-2,7.3138815207780733E-2,8.9761273209549075E-2,0.10571883289124669,0.12101149425287357,0.13563925729442969,0.14960212201591511,0.16290008841732978,0.17553315649867374,0.18750132625994695,0.19880459770114944,0.20944297082228117,0.21941644562334217,0.22872502210433246,0.23736870026525198,0.2453474801061008,0.25266136162687886,0.25931034482758619,0.26529442970822281,0.27061361626878866,0.27526790450928385,0.27925729442970826,0.2825817860300619,0.28524137931034482,0.28723607427055703,0.28856587091069852,0.28923076923076924,0.28923076923076924,null,5,0.8552346598559708,5,0.91728931697935079]
[null,null,null,null,null,null,null,null,null,null,null,null,null,null,null,5,0,2.3589743589743591E-2,4.6366047745358088E-2,6.83289124668435E-2,8.9478337754199833E-2,0.10981432360742706,0.12933687002652522,0.14804597701149427,0.16594164456233421,0.18302387267904507,0.19929266136162688,0.21474801061007959,0.22938992042440318,0.24321839080459773,0.25623342175066316,0.2684350132625995,0.27982316534040674,0.2903978779840849,0.30015915119363396,0.30910698496905392,0.31724137931034485,0.32456233421750663,0.33106984969053932,0.33676392572944303,0.34164456233421753,0.34571175950486299,0.34896551724137931,0.35140583554376659,0.35303271441202483,0.35384615384615387,0.35384615384615387,null,6,0.7024436561691455,6,0.40926511065645099]
[null,"Parte A",null,"Parte B",null,null,null,null,null,null,null,null,null,null,null,6,0,2.7692307692307693E-2,5.4429708222811665E-2,8.0212201591511934E-2,0.1050397877984085,0.12891246684350133,0.15183023872679047,0.17379310344827589,0.19480106100795755,0.21485411140583552,0.23395225464190983,0.25209549071618037,0.26928381962864723,0.28551724137931034,0.30079575596816976,0.31511936339522545,0.32848806366047745,0.34090185676392576,0.35236074270557033,0.36286472148541116,0.3724137931034483,0.3810079575596817,0.38864721485411141,0.39533156498673749,0.40106100795755972,0.40583554376657827,0.40965517241379312,0.41251989389920424,0.41442970822281172,0.41538461538461541,0.41538461538461541,null,7,0.92508239082640187,7,0.49869269201935174]
[null,"Temas que sabes","Posibilidades","Temas que sabes","Posibilidades",null,null,null,null,null,null,null,null,null,null,7,0,3.1589743589743584E-2,6.2090185676392559E-2,9.1501326259946947E-2,0.11982316534040673,0.14705570291777187,0.17319893899204242,0.19825287356321838,0.22221750663129969,0.24509283819628641,0.26687886825817858,0.28757559681697609,0.30718302387267898,0.32570114942528733,0.34312997347480101,0.35946949602122014,0.3747197170645446,0.38888063660477451,0.40195225464190981,0.41393457117595039,0.42482758620689653,0.43463129973474796,0.44334571175950482,0.45097082228116714,0.45750663129973473,0.46295313881520778,0.46731034482758615,0.47057824933686998,0.47275685234305925,0.47384615384615381,0.47384615384615381,null,8,0.41496028328106283,8,0.90857638562410403]
[null,30,{"$f":"(B15/30)+(((30-B15)/30)*(B15/29))","v":1},26,{"$f":"(D15/26)+(((26-D15)/26)*(D15/25))","v":1},null,null,null,null,null,null,null,null,null,null,8,0,3.5282051282051287E-2,6.9347480106100798E-2,0.10219628647214855,0.13382847038019455,0.16424403183023875,0.19344297082228118,0.22142528735632186,0.24819098143236074,0.27374005305039789,0.29807250221043324,0.32118832891246685,0.3430875331564987,0.36377011494252876,0.38323607427055706,0.40148541114058356,0.41851812555260837,0.43433421750663131,0.44893368700265257,0.46231653404067197,0.47448275862068973,0.48543236074270557,0.49516534040671972,0.50368169761273218,0.51098143236074278,0.51706454465075158,0.52193103448275868,0.52558090185676398,0.52801414677276759,0.52923076923076928,0.52923076923076928,null,9,0.58466564765350604,9,0.46016127814310948]
[null,29,{"$f":"(B16/30)+(((30-B16)/30)*(B16/29))","v":1},25,{"$f":"(D16/26)+(((26-D16)/26)*(D16/25))","v":1},null,null,null,null,null,null,null,null,null,null,9,0,{"$f":"VLOOKUP($P16,$D$15:$E$41,2,FALSE)*VLOOKUP(R$6,$B$15:$C$45,2,FALSE)","v":3.8769230769230771E-2},7.620159151193634E-2,0.11229708222811671,0.1470557029177719,0.18047745358090186,0.21256233421750664,0.24331034482758623,0.27272148541114055,0.30079575596816971,0.32753315649867376,0.35293368700265254,0.3769973474801061,0.39972413793103451,0.42111405835543769,0.44116710875331566,0.45988328912466847,0.47726259946949601,0.49330503978779844,0.5080106100795756,0.52137931034482765,0.53341114058355432,0.54410610079575594,0.5534641909814324,0.56148541114058359,0.56816976127320962,0.57351724137931037,0.57752785145888597,0.5802015915119364,0.58153846153846156,0.58153846153846156,null,10,0.98121650521708181,10,0.52555748054467288]
[null,28,0.99770114942528743,24,0.99692307692307702,null,null,null,null,null,null,null,null,null,null,10,0,4.205128205128205E-2,8.2652519893899198E-2,0.12180371352785145,0.15950486295313882,0.19575596816976126,0.23055702917771884,0.26390804597701151,0.29580901856763919,0.32625994694960209,0.35526083112290008,0.38281167108753311,0.4089124668435013,0.43356321839080458,0.45676392572944297,0.47851458885941639,0.49881520778072502,0.5176657824933687,0.53506631299734753,0.55101679929266134,0.56551724137931036,0.57856763925729437,0.59016799292661359,0.60031830238726791,0.60901856763925732,0.61626878868258184,0.62206896551724133,0.62641909814323604,0.62931918656056585,0.63076923076923075,0.63076923076923075,null,11,0.12160084751688538,11,0.94429369078540992]
[null,27,0.99310344827586206,23,0.99076923076923074,null,null,null,null,null,null,null,null,null,null,11,0,4.5128205128205132E-2,8.8700265251989388E-2,0.1307161803713528,0.17117595048629533,0.210079575596817,0.24742705570291779,0.28321839080459771,0.31745358090185671,0.35013262599469491,0.38125552608311231,0.41082228116710878,0.43883289124668434,0.4652873563218391,0.49018567639257299,0.51352785145888591,0.53531388152077808,0.55554376657824933,0.57421750663129978,0.5913351016799292,0.60689655172413792,0.62090185676392573,0.63335101679929262,0.64424403183023882,0.65358090185676398,0.66136162687886835,0.66758620689655179,0.67225464190981432,0.67536693191865615,0.67692307692307696,0.67692307692307696,null,12,0.84914564512008606,12,0.85819309823056955]
[null,26,0.98620689655172411,22,0.98153846153846147,null,null,null,null,null,null,null,null,null,null,12,0,4.8000000000000001E-2,9.4344827586206881E-2,0.13903448275862068,0.18206896551724139,0.22344827586206897,0.26317241379310347,0.30124137931034484,0.33765517241379306,0.37241379310344819,0.40551724137931033,0.43696551724137928,0.46675862068965512,0.49489655172413793,0.52137931034482754,0.54620689655172405,0.56937931034482758,0.59089655172413791,0.61075862068965514,0.62896551724137928,0.64551724137931032,0.66041379310344817,0.67365517241379302,0.6852413793103449,0.69517241379310346,0.70344827586206893,0.7100689655172413,0.71503448275862069,0.71834482758620688,0.72,0.72,null,13,0.45553435743911519,13,0.80469733571897206]
[null,25,0.97701149425287359,21,0.96923076923076923,null,null,null,null,null,null,null,null,null,null,13,0,5.0666666666666665E-2,9.9586206896551718E-2,0.14675862068965517,0.19218390804597704,0.23586206896551726,0.27779310344827585,0.31797701149425289,0.35641379310344823,0.39310344827586202,0.42804597701149422,0.46124137931034481,0.49268965517241375,0.52239080459770115,0.55034482758620695,0.57655172413793099,0.60101149425287359,0.62372413793103443,0.64468965517241383,0.66390804597701147,0.68137931034482757,0.69710344827586201,0.71108045977011491,0.72331034482758627,0.73379310344827586,0.74252873563218391,0.74951724137931031,0.75475862068965516,0.75825287356321847,0.76,0.76,null,14,0.54340142666938374,14,0.13964109636474864]
[null,24,0.96551724137931039,20,0.9538461538461539,null,null,null,null,null,null,null,null,null,null,14,0,5.3128205128205132E-2,0.10442440318302386,0.15388859416445624,0.20152077807250224,0.24732095490716183,0.29128912466843504,0.33342528735632188,0.37372944297082222,0.4122015915119363,0.44884173297966401,0.48364986737400534,0.51662599469496018,0.54777011494252881,0.57708222811671095,0.6045623342175066,0.63021043324491599,0.654026525198939,0.67601061007957564,0.69616268788682578,0.71448275862068966,0.73097082228116705,0.74562687886825818,0.75845092838196304,0.76944297082228119,0.77860300618921319,0.78593103448275858,0.79142705570291783,0.79509106984969058,0.79692307692307696,0.79692307692307696,null,15,0.34233296481240916,15,0.96099968081812637]
[null,23,0.95172413793103461,19,0.93538461538461537,null,null,null,null,null,null,null,null,null,null,15,0,5.5384615384615379E-2,0.10885941644562332,0.16042440318302387,0.21007957559681698,0.25782493368700266,0.30366047745358088,0.34758620689655173,0.38960212201591504,0.42970822281167098,0.46790450928381955,0.50419098143236074,0.53856763925729434,0.57103448275862068,0.60159151193633953,0.6302387267904509,0.65697612732095489,0.68180371352785141,0.70472148541114055,0.7257294429708222,0.74482758620689649,0.76201591511936329,0.77729442970822271,0.79066312997347488,0.80212201591511934,0.81167108753315642,0.81931034482758613,0.82503978779840836,0.82885941644562333,0.8307692307692307,0.8307692307692307,null,16,0.40228848758029323,16,0.31071415312576411]
[null,22,0.93563218390804592,18,0.91384615384615386,null,null,null,null,null,null,null,null,null,null,16,0,5.7435897435897436E-2,0.11289124668435012,0.1663660477453581,0.21786030061892134,0.2673740053050398,0.31490716180371353,0.36045977011494257,0.40403183023872674,0.44562334217506627,0.48523430592396111,0.52286472148541119,0.55851458885941641,0.59218390804597709,0.62387267904509291,0.65358090185676387,0.6813085764809903,0.70705570291777187,0.73082228116710879,0.75260831122900085,0.77241379310344838,0.79023872679045093,0.80608311229000884,0.81994694960212222,0.83183023872679052,0.84173297966401417,0.84965517241379318,0.85559681697612733,0.85955791335101694,0.86153846153846159,0.86153846153846159,null,17,0.92161561688174598,17,0.76678544051238773]
[null,21,0.91724137931034477,17,0.88923076923076927,null,null,null,null,null,null,null,null,null,null,17,0,5.928205128205128E-2,0.11651989389920424,0.17171352785145888,0.22486295313881524,0.27596816976127325,0.32502917771883294,0.37204597701149428,0.41701856763925726,0.45994694960212196,0.50083112290008847,0.53967108753315651,0.57646684350132626,0.61121839080459772,0.64392572944297088,0.67458885941644564,{"$f":"VLOOKUP($P24,$D$15:$E$41,2,FALSE)*VLOOKUP(AG$6,$B$15:$C$45,2,FALSE)","v":0.7032077807250221},0.72978249336870027,0.75431299734748014,0.77679929266136161,0.79724137931034489,0.81563925729442965,0.83199292661361623,0.84630238726790463,0.85856763925729451,0.8687886825817861,0.87696551724137928,0.88309814323607427,0.88718656056587097,0.88923076923076927,0.88923076923076927,null,18,0.13232228685573688,18,0.25918914027573392]
[null,20,0.89655172413793105,16,0.86153846153846159,null,null,null,null,null,null,null,null,null,null,18,0,6.092307692307692E-2,0.11974535809018566,0.17646684350132627,0.23108753315649869,0.28360742705570291,0.33402652519893899,0.38234482758620691,0.42856233421750656,0.47267904509283815,0.51469496021220162,0.55461007957559683,0.59242440318302381,0.62813793103448279,0.66175066312997344,0.69326259946949598,0.72267374005305041,0.74998408488063661,0.77519363395225471,0.79830238726790448,0.81931034482758625,0.83821750663129968,0.85502387267904501,0.86972944297082244,0.88233421750663132,0.89283819628647221,0.90124137931034487,0.90754376657824931,0.91174535809018575,0.91384615384615386,0.91384615384615386,null,19,0.3757148812116663,19,0.70593467234900542]
[null,19,0.87356321839080453,15,0.8307692307692307,null,null,null,null,null,null,null,null,null,null,19,0,6.2358974358974355E-2,0.12256763925729441,0.18062599469496021,0.23653404067197173,0.29029177718832894,0.34189920424403181,0.39135632183908048,0.43866312997347473,0.48381962864721478,0.52682581786030058,0.56768169761273213,0.60638726790450925,0.64294252873563218,0.6773474801061008,0.7096021220159151,0.7397064544650751,0.7676604774535809,0.79346419098143239,0.81711759504862946,0.83862068965517245,0.8579734748010609,0.87517595048629526,0.89022811671087543,0.90312997347480106,0.9138815207780725,0.92248275862068962,0.92893368700265244,0.93323430592396117,0.93538461538461537,0.93538461538461537,null,20,0.1632685797232446,20,0.89624126172312069]
[null,18,0.84827586206896555,14,0.79692307692307696,null,null,null,null,null,null,null,null,null,null,20,0,6.3589743589743591E-2,0.1249867374005305,0.18419098143236076,0.24120247568523434,0.29602122015915122,0.34864721485411143,0.39908045977011497,0.44732095490716178,0.49336870026525192,0.53722369584438556,0.57888594164456231,0.61835543766578249,0.65563218390804601,0.69071618037135285,0.72360742705570291,0.75430592396109641,0.78281167108753313,0.80912466843501329,0.83324491600353667,0.85517241379310349,0.87490716180371353,0.8924491600353669,0.90779840848806381,0.92095490716180384,0.93191865605658719,0.94068965517241387,0.94726790450928389,0.95165340406719734,0.9538461538461539,0.9538461538461539,null,21,3.2317172076447798E-2,21,1.7934666384162967E-2]
[null,17,0.82068965517241377,13,0.76,null,null,null,null,null,null,null,null,null,null,21,0,6.4615384615384616E-2,0.12700265251989387,0.18716180371352784,0.24509283819628649,0.30079575596816976,0.3542705570291777,0.40551724137931039,0.4545358090185676,0.50132625994694957,0.54588859416445623,0.58822281167108748,0.62832891246684341,0.66620689655172416,0.70185676392572949,0.7352785145888594,0.76647214854111401,0.79543766578249331,0.82217506631299742,0.84668435013262588,0.86896551724137927,0.88901856763925724,0.9068435013262599,0.92244031830238737,0.93580901856763932,0.94694960212201595,0.95586206896551718,0.9625464190981432,0.96700265251989392,0.96923076923076923,0.96923076923076923,null,22,0.70467032610840541,22,0.80496838871124687]
[null,16,0.79080459770114941,12,0.72,null,null,null,null,null,null,null,null,null,null,22,0,6.5435897435897436E-2,0.1286153846153846,0.18953846153846152,0.24820512820512822,0.30461538461538462,0.35876923076923073,0.41066666666666668,0.4603076923076922,0.50769230769230755,0.55282051282051281,0.59569230769230763,0.63630769230769224,0.67466666666666664,0.71076923076923071,0.74461538461538457,0.7762051282051281,0.80553846153846143,0.83261538461538454,0.85743589743589732,0.88,0.90030769230769214,0.91835897435897429,0.93415384615384622,0.94769230769230772,0.9589743589743589,0.96799999999999986,0.97476923076923072,0.97928205128205126,0.98153846153846147,0.98153846153846147,null,23,0.55914728711743245,23,0.60334284285127726]
[null,15,0.75862068965517238,11,0.67692307692307696,null,null,null,null,null,null,null,null,null,null,23,{"$f":"VLOOKUP($P30,$D$15:$E$41,2,FALSE)*VLOOKUP(Q$6,$B$15:$C$45,2,FALSE)","v":0},6.6051282051282051E-2,0.12982493368700262,0.19132095490716181,0.25053934571175951,0.30748010610079574,0.36214323607427057,0.4145287356321839,0.46463660477453572,0.51246684350132621,0.55801945181255519,0.60129442970822278,0.64229177718832886,0.68101149425287355,0.71745358090185674,0.75161803713527842,0.78350486295313881,0.8131140583554376,0.8404456233421751,0.86549955791335087,0.88827586206896547,0.90877453580901846,0.92699557913351005,0.94293899204244036,0.95660477453580905,0.96799292661361624,0.97710344827586204,0.98393633952254633,0.98849160035366934,0.99076923076923074,0.99076923076923074,null,24,0.22837178625040799,24,0.70574060907750735]
[null,14,0.72413793103448276,10,0.63076923076923075,null,null,null,null,null,null,null,null,null,null,24,0,6.6461538461538461E-2,0.13063129973474802,0.19250928381962867,0.25209549071618043,0.30938992042440322,0.36439257294429711,0.41710344827586215,0.46752254641909813,0.51564986737400531,0.56148541114058359,0.60502917771883291,0.64628116710875338,0.6852413793103449,0.72190981432360746,0.75628647214854117,0.78837135278514592,0.81816445623342182,0.84566578249336877,0.87087533156498675,0.89379310344827601,0.91441909814323608,0.93275331564986741,0.94879575596817001,0.96254641909814342,0.97400530503978788,0.98317241379310349,0.99004774535809026,0.99463129973474818,0.99692307692307702,0.99692307692307702,null,25,0.19296774149667073,25,2.8257164002526425E-2]
[null,13,0.68735632183908046,9,0.58153846153846156,null,null,null,null,null,null,null,null,null,null,25,0,6.6666666666666666E-2,0.13103448275862067,0.19310344827586207,0.25287356321839083,0.31034482758620691,0.36551724137931035,0.41839080459770117,0.46896551724137925,0.51724137931034475,0.56321839080459768,0.60689655172413792,0.64827586206896548,0.68735632183908046,0.72413793103448276,0.75862068965517238,0.79080459770114941,0.82068965517241377,0.84827586206896555,0.87356321839080453,0.89655172413793105,0.91724137931034477,0.93563218390804592,0.95172413793103461,0.96551724137931039,0.97701149425287359,0.98620689655172411,0.99310344827586206,0.99770114942528743,1,1,null,26,0.73964778572479939,26,0.78320661689066851]
[null,12,0.64827586206896548,8,0.52923076923076928,null,null,null,null,null,null,null,null,null,null,26,0,{"$f":"VLOOKUP($P33,$D$15:$E$41,2,FALSE)*VLOOKUP(R$6,$B$15:$C$45,2,FALSE)","v":6.6666666666666666E-2},0.13103448275862067,0.19310344827586207,0.25287356321839083,0.31034482758620691,0.36551724137931035,0.41839080459770117,0.46896551724137925,0.51724137931034475,0.56321839080459768,0.60689655172413792,0.64827586206896548,0.68735632183908046,0.72413793103448276,0.75862068965517238,0.79080459770114941,0.82068965517241377,0.84827586206896555,0.87356321839080453,0.89655172413793105,0.91724137931034477,0.93563218390804592,0.95172413793103461,0.96551724137931039,0.97701149425287359,0.98620689655172411,0.99310344827586206,0.99770114942528743,1,1,null,27,0.96538382292973313]
[null,11,0.60689655172413792,7,0.47384615384615381,null,null,null,null,null,null,null,null,null,null,null,null,null,null,null,null,null,null,null,null,null,null,null,null,null,null,null,null,null,null,null,null,null,null,null,null,null,null,null,null,null,null,null,28,0.44479871908993307]
[null,10,0.56321839080459768,6,0.41538461538461541,null,null,null,null,null,null,null,null,null,null,null,null,null,null,null,null,null,null,null,null,null,null,null,null,null,null,null,null,null,null,null,null,null,null,null,null,null,null,null,null,null,null,null,29,0.77654514406683572]
[null,9,0.51724137931034475,5,0.35384615384615387,null,null,null,null,null,null,null,null,null,"Probabilidad de aprobar por tema estudiado",null,null,null,null,null,null,null,null,null,null,null,null,null,null,null,null,null,null,null,null,null,null,null,null,null,null,null,null,null,null,null,null,null,30,0.31074621079404852]
[null,8,0.46896551724137925,4,0.28923076923076924,null,null,null,null,null,null,null,null,null,null,null,"Temas que te sabes parte A"]
[null,7,0.41839080459770117,3,0.22153846153846152,null,null,null,null,null,null,null,null,null,null,null,0,1,2,3,4,5,6,7,8,9,10,11,12,13,14,15,16,17,18,19,20,21,22,23,24,25,26,27,28,29,30]
[null,6,0.36551724137931035,2,0.15076923076923077,null,null,null,null,null,null,null,null,null,"Temas que te sabes parte B",0,{"$f":"IFERROR(VLOOKUP($P39,$D$15:$E$41,2,FALSE)*VLOOKUP(Q$6,$B$15:$C$45,2,FALSE)/($P39+Q$38),0)","v":0},{"$f":"IFERROR(VLOOKUP($P39,$D$15:$E$41,2,FALSE)*VLOOKUP(R$6,$B$15:$C$45,2,FALSE)/($P39+R$38),0)","v":0},0,0,0,0,0,0,0,0,0,0,0,0,0,0,0,0,0,0,0,0,0,0,0,0,0,0,0,0,0]
[null,5,0.31034482758620691,1,7.6923076923076927E-2,null,null,null,null,null,null,null,null,null,null,1,{"$f":"IFERROR(VLOOKUP($P40,$D$15:$E$41,2,FALSE)*VLOOKUP(Q$6,$B$15:$C$45,2,FALSE)/($P40+Q$38),0)","v":0},2.5641025641025641E-3,3.359858532272325E-3,3.7135278514588859E-3,3.8903625110521664E-3,3.9787798408488064E-3,4.0166729821902239E-3,4.0229885057471272E-3,4.008252284114353E-3,3.9787798408488064E-3,3.938590145486697E-3,3.8903625110521668E-3,3.8359518465619262E-3,3.7766830870279151E-3,3.7135278514588859E-3,3.6472148541114059E-3,3.578301347064025E-3,3.5072207486000592E-3,3.4343152310484432E-3,3.359858532272325E-3,3.2840722495894909E-3,3.2071376898963107E-3,3.1292046284550033E-3,3.0503978779840859E-3,2.9708222811671093E-3,2.8905665510440045E-3,2.80970625798212E-3,2.7283061765820391E-3,2.6464221470166777E-3,2.5641025641025641E-3,2.4813895781637717E-3]
[null,4,0.25287356321839083,0,0,null,null,null,null,null,null,null,null,null,null,2,0,3.3504273504273503E-3,4.9389920424403174E-3,5.8228116710875326E-3,6.3542587680518728E-3,6.6843501326259947E-3,6.8885941644562338E-3,7.0089399744572168E-3,7.0705570291777183E-3,7.0894622618760533E-3,7.0763336280577661E-3,7.0385635584574576E-3,6.9814323607427049E-3,6.9088122605363983E-3,6.8236074270557031E-3,6.7280386955843345E-3,6.6238333824540719E-3,6.5123551584531621E-3,6.3946949602122025E-3,6.2717359269083405E-3,6.1442006269592474E-3,6.0126859647099528E-3,5.8776893604479815E-3,5.7396286472148547E-3,5.5988573760457055E-3,5.4556767200445366E-3,5.3103448275862069E-3,5.1630842403731815E-3,5.0140878278809317E-3,4.8635235732009926E-3,4.7115384615384615E-3]
[null,3,0.19310344827586207,null,null,null,null,null,null,null,null,null,null,null,null,3,0,3.6923076923076918E-3,5.8058355437665774E-3,7.12997347480106E-3,8.0030314513073134E-3,8.5941644562334205E-3,8.9973474801061E-3,9.2689655172413787E-3,9.4448999276585469E-3,9.5490716180371329E-3,9.5980412160783495E-3,9.6036377415687751E-3,9.574535809018566E-3,9.5172413793103445E-3,9.4367295990014036E-3,9.3368700265251976E-3,9.2207175764344538E-3,9.090716180371352E-3,8.9488442591890861E-3,8.7967205208584493E-3,8.6356821589205386E-3,8.4668435013262582E-3,8.2911405835543756E-3,8.1093654356253833E-3,7.9221927497789574E-3,7.7302008336491085E-3,7.5338882282996429E-3,7.333687002652519E-3,7.1299734748010608E-3,6.9230769230769224E-3,6.7132867132867124E-3]
[null,2,0.13103448275862067,null,null,null,null,null,null,null,null,null,null,null,null,4,0,3.8564102564102565E-3,6.3165340406719714E-3,7.9787798408488073E-3,9.1423519009725916E-3,9.9734748010610087E-3,1.0571883289124669E-2,1.1001044932079415E-2,1.1303271441202474E-2,1.1507855539685778E-2,1.1635720601237841E-2,1.1702210433244915E-2,1.1718832891246684E-2,1.1694388100067614E-2,1.1635720601237843E-2,1.1548233980175904E-2,1.1436251105216623E-2,1.1303271441202476E-2,1.1152158186640946E-2,1.0985276592472993E-2,1.0804597701149424E-2,1.0611777188328913E-2,1.0408216010338025E-2,1.019510757441792E-2,9.9734748010610087E-3,9.7441995182779972E-3,9.508045977011494E-3,9.2656798151792598E-3,9.0176834659593287E-3,8.7645687645687646E-3,8.5067873303167427E-3]
[null,1,6.6666666666666666E-2,null,null,null,null,null,null,null,null,null,null,null,null,5,0,3.9316239316239321E-3,6.6237211064797269E-3,8.5411140583554375E-3,9.9420375282444264E-3,1.0981432360742706E-2,1.1757897275138656E-2,1.2337164750957856E-2,1.2764741889410323E-2,1.3073133762788933E-2,1.3286177424108458E-2,1.3421750663129974E-2,1.3493524730847245E-2,1.3512132822477652E-2,1.3485969565824377E-2,1.3421750663129974E-2,1.3324912635257464E-2,1.3199903544731132E-2,1.3050397877984085E-2,1.2879457707043913E-2,1.2689655172413794E-2,1.2483166700673332E-2,1.2261846284834789E-2,1.2027283061765823E-2,1.1780846977041983E-2,1.1523725316828767E-2,1.1256952169076751E-2,1.0981432360742706E-2,1.0697961042788631E-2,1.0407239819004526E-2,1.0109890109890111E-2]
[null,0,0,null,null,null,null,null,null,null,null,null,null,null,null,6,0,3.956043956043956E-3,6.8037135278514582E-3,8.9124668435013252E-3,1.0503978779840851E-2,1.1719315167591031E-2,1.2652519893899206E-2,1.3368700265251991E-2,1.3914361500568396E-2,1.4323607427055702E-2,1.4622015915119364E-2,1.4829146512716492E-2,1.4960212201591513E-2,1.5027223230490017E-2,1.5039787798408488E-2,1.5005683971201212E-2,1.4931275620930794E-2,1.482181985930112E-2,1.4681697612732096E-2,1.4514588859416446E-2,1.4323607427055704E-2,1.4111405835543767E-2,1.3880257673361122E-2,1.3632122930577155E-2,1.3368700265251991E-2,1.3091469153760589E-2,1.2801724137931035E-2,1.2500602845430432E-2,1.2189109065376815E-2,1.1868131868131869E-2,1.1538461538461539E-2]
[null,null,null,null,null,null,null,null,null,null,null,null,null,null,null,7,0,3.948717948717948E-3,6.8989095195991735E-3,9.1501326259946954E-3,1.0893015030946066E-2,1.2254641909814323E-2,1.3322995307080187E-2,1.4160919540229884E-2,1.4814500442086646E-2,1.5318302387267901E-2,1.5698756956363445E-2,1.5976422045387559E-2,1.6167527572246262E-2,1.6285057471264366E-2,1.6339522546419096E-2,1.6339522546419096E-2,1.6292161611501939E-2,1.620335985853227E-2,1.6078090185676394E-2,1.5920560429844247E-2,1.5734355044699871E-2,1.5522546419098142E-2,1.5287783164120857E-2,1.503236074270557E-2,1.4758278429023702E-2,1.4467285587975243E-2,1.4160919540229883E-2,1.3840536745202059E-2,1.3507338638373121E-2,1.3162393162393161E-2,1.2806652806652805E-2]
[null,null,null,null,null,null,null,null,null,null,null,null,null,null,null,8,0,3.9202279202279209E-3,6.9347480106100798E-3,9.2905714974680503E-3,1.1152372531682879E-2,1.263415629463375E-2,1.381735505873437E-2,1.476168582375479E-2,1.5511936339522546E-2,1.6102356061788111E-2,1.6559583456135181E-2,1.6904648890129836E-2,1.7154376657824936E-2,1.7322386425834703E-2,1.7419821557752593E-2,1.7455887440894938E-2,1.7438255231358682E-2,1.7373368700265252E-2,1.7266680269332792E-2,1.7122834594098961E-2,1.6945812807881776E-2,1.673904692216226E-2,1.6505511346890659E-2,1.6247796697184909E-2,1.5968169761273212E-2,1.5668622565174289E-2,1.5350912778904668E-2,1.5016597195907542E-2,1.4667059632576878E-2,1.4303534303534305E-2,1.3927125506072877E-2]
[null,null,null,null,null,null,null,null,null,null,null,null,null,null,null,9,0,{"$f":"IFERROR(VLOOKUP($P48,$D$15:$E$41,2,FALSE)*VLOOKUP(R$6,$B$15:$C$45,2,FALSE)/($P48+R$38),0)","v":3.8769230769230773E-3},6.9274174101760311E-3,9.3580901856763921E-3,1.1311977147520915E-2,1.2891246684350132E-2,1.417082228116711E-2,1.520689655172414E-2,1.6042440318302386E-2,1.6710875331564984E-2,1.7238587184140723E-2,1.7646684350132627E-2,1.7952254641909814E-2,1.8169278996865205E-2,1.8309306885019031E-2,1.8381962864721487E-2,1.8395331564986739E-2,1.8356253825749846E-2,1.8270557029177719E-2,1.8143236074270559E-2,1.7978596908442331E-2,1.7780371352785145E-2,1.7551809703088901E-2,1.7295755968169763E-2,1.7014709428502531E-2,1.6710875331564987E-2,1.6386206896551726E-2,1.6042440318302389E-2,1.56811240949172E-2,1.5303643724696357E-2,1.4911242603550296E-2]
[null,null,null,null,null,null,null,null,null,null,null,null,null,null,null,10,0,3.8228438228438228E-3,6.8877099911582662E-3,9.369516425219342E-3,1.1393204496652773E-2,1.3050397877984085E-2,1.4409814323607427E-2,1.5524002704530089E-2,1.6433834364868845E-2,1.7171576155242216E-2,1.7763041556145005E-2,1.8229127194644434E-2,1.8586930311068242E-2,1.8850574712643679E-2,1.9031830238726791E-2,1.9140583554376655E-2,1.9185200299258656E-2,1.9172806759013655E-2,1.9109511178476698E-2,1.9000579285953841E-2,1.8850574712643679E-2,1.8663472234106269E-2,1.8442749778956675E-2,1.8191463708705089E-2,1.7912310812919333E-2,1.7607679676645196E-2,1.7279693486590038E-2,1.6930245895763137E-2,1.656103122527805E-2,1.6173570019723867E-2,1.5769230769230768E-2]
[null,null,null,null,null,null,null,null,null,null,null,null,null,null,null,11,0,3.7606837606837611E-3,6.8230973270761068E-3,9.3368700265251993E-3,1.1411730032419689E-2,1.3129973474801063E-2,1.4554532688406929E-2,1.5734355044699874E-2,1.670808320536088E-2,1.7506631299734746E-2,1.8155025051576776E-2,1.8673740053050399E-2,1.9079690923768884E-2,1.9386973180076629E-2,1.9607427055702918E-2,1.9751071209957151E-2,1.9826440056325115E-2,1.9840848806366048E-2,1.9800603676941371E-2,1.9711170055997641E-2,1.9577308120133481E-2,1.9403183023872679E-2,1.9192455054524018E-2,1.8948353877359964E-2,1.8673740053050399E-2,1.8371156302190786E-2,1.8042870456663564E-2,1.7690911629205639E-2,1.7317100818427082E-2,1.6923076923076923E-2,1.651031894934334E-2]
[null,null,null,null,null,null,null,null,null,null,null,null,null,null,null,12,0,3.6923076923076922E-3,6.7389162561576343E-3,9.2689655172413787E-3,1.1379310344827587E-2,1.3144016227180528E-2,1.4620689655172416E-2,1.5854809437386569E-2,1.6882758620689654E-2,1.7733990147783246E-2,1.8432601880877742E-2,1.8998500749625186E-2,1.9448275862068962E-2,1.9795862068965518E-2,2.0053050397877983E-2,2.022988505747126E-2,2.0334975369458129E-2,2.0375743162901309E-2,2.0358620689655171E-2,2.028921023359288E-2,2.0172413793103448E-2,2.0012539184952976E-2,1.981338742393509E-2,1.9578325123152711E-2,1.9310344827586208E-2,1.90121155638397E-2,1.8686025408348454E-2,1.8334217506631299E-2,1.7958620689655171E-2,1.7560975609756096E-2,1.7142857142857144E-2]
[null,null,null,null,null,null,null,null,null,null,null,null,null,null,null,13,0,3.619047619047619E-3,6.6390804597701147E-3,9.1724137931034483E-3,1.1304935767410415E-2,1.3103448275862069E-2,1.4620689655172414E-2,1.5898850574712645E-2,1.6972085385878487E-2,1.7868338557993729E-2,1.8610694652673662E-2,1.9218390804597699E-2,1.9707586206896551E-2,2.0091954022988506E-2,2.0383141762452109E-2,2.0591133004926106E-2,2.0724534284581847E-2,2.0790804597701149E-2,2.0796440489432706E-2,2.0747126436781609E-2,2.06478578892372E-2,2.0503042596348883E-2,2.0316584564860424E-2,2.0091954022988509E-2,1.983224603914259E-2,1.9540229885057471E-2,1.9218390804597699E-2,1.886896551724138E-2,1.8493972525932156E-2,1.8095238095238095E-2,1.7674418604651163E-2]
[null,null,null,null,null,null,null,null,null,null,null,null,null,null,null,14,0,3.541880341880342E-3,6.5265251989389912E-3,9.052270244968014E-3,1.119559878180568E-2,1.3016892363534833E-2,1.4564456233421752E-2,1.5877394636015327E-2,1.6987701953219192E-2,1.7921808326605927E-2,1.8701738874152666E-2,1.9345994694960213E-2,1.9870230565190775E-2,2.0287782034908473E-2,2.061007957559682E-2,2.0846977041982986E-2,2.1007014441497201E-2,2.1097629845127065E-2,2.1125331564986739E-2,2.1095839026873509E-2,2.1014198782961461E-2,2.0884880636604774E-2,2.0711857746340503E-2,2.0498673740053056E-2,2.0248499232165294E-2,1.996417964587726E-2,1.9648275862068965E-2,1.9303098919583362E-2,1.8930739758325967E-2,1.8533094812164582E-2,1.8111888111888113E-2]
[null,null,null,null,null,null,null,null,null,null,null,null,null,null,null,15,0,3.4615384615384612E-3,6.4034950850366656E-3,8.9124668435013252E-3,1.1056819768253526E-2,1.2891246684350132E-2,1.4460022735884804E-2,1.5799373040752351E-2,1.6939222696344132E-2,1.7904509283819623E-2,1.8716180371352781E-2,1.9391960824321566E-2,1.9946949602122014E-2,2.0394088669950738E-2,2.0744534894356535E-2,2.1007957559681698E-2,2.1192778300675966E-2,2.1306366047745356E-2,2.135519652761032E-2,2.1344983616788889E-2,2.1280788177339898E-2,2.1167108753315646E-2,2.1007957559681694E-2,2.0806924472986182E-2,2.0567231177310751E-2,2.0291777188328912E-2,1.9983179142136247E-2,1.9643804471390674E-2,1.9275800382456357E-2,1.8881118881118878E-2,1.846153846153846E-2]
[null,null,null,null,null,null,null,null,null,null,null,null,null,null,null,16,0,3.3785822021116137E-3,6.2717359269083396E-3,8.7561077760714787E-3,1.0893015030946068E-2,1.273209549071618E-2,1.4313961900168797E-2,1.5672163918040983E-2,1.6834659593280281E-2,1.782493368700265E-2,1.8662857920152352E-2,1.936536005501523E-2,1.9946949602122014E-2,2.0420134760206106E-2,2.0795755968169762E-2,2.1083254898605287E-2,2.1290893015030947E-2,2.1425930391447634E-2,2.1494772975503201E-2,2.1503094606542882E-2,2.145593869731801E-2,2.1357803426768945E-2,2.1212713481316023E-2,2.1024280759028773E-2,2.0795755968169762E-2,2.0530072674732051E-2,2.0229885057471267E-2,1.9897600394793657E-2,1.9535407121614022E-2,1.9145299145299145E-2,1.8729096989966557E-2]
[null,null,null,null,null,null,null,null,null,null,null,null,null,null,null,17,0,3.2934472934472935E-3,6.1326259946949601E-3,8.5856763925729433E-3,1.0707759673276916E-2,1.2544007716421512E-2,1.4131703379079694E-2,1.5501915708812262E-2,1.6680742705570292E-2,1.7690267292389306E-2,1.8549300848151425E-2,1.9273967411898445E-2,1.9878167017287111E-2,2.0373946360153258E-2,2.0771797723966801E-2,2.1080901856763926E-2,{"$f":"IFERROR(VLOOKUP($P56,$D$15:$E$41,2,FALSE)*VLOOKUP(AG$6,$B$15:$C$45,2,FALSE)/($P56+AG$38),0)","v":2.1309326688637033E-2},2.146419098143236E-2,2.1551799924213719E-2,2.1577758129482268E-2,2.1547064305684996E-2,2.146419098143236E-2,2.1333151964451697E-2,2.1157559681697614E-2,2.0940674128226696E-2,2.0685444823375858E-2,2.0394546912590215E-2,2.0070412346274415E-2,1.97152569014638E-2,1.9331103678929765E-2,1.8919803600654664E-2]
[null,null,null,null,null,null,null,null,null,null,null,null,null,null,null,18,0,3.2064777327935222E-3,5.9872679045092827E-3,8.4031830238726797E-3,1.0503978779840849E-2,1.2330757698074039E-2,1.3917771883289125E-2,1.5293793103448276E-2,1.6483166700673329E-2,1.7506631299734746E-2,1.8381962864721487E-2,1.9124485502606786E-2,1.9747480106100793E-2,2.0262513904338156E-2,2.067970822281167E-2,2.1007957559681698E-2,2.1255110001560305E-2,2.1428116710875331E-2,2.1533156498673742E-2,2.1575740196429851E-2,2.1560798548094375E-2,2.1492756580289735E-2,2.1375596816976126E-2,2.121291324319079E-2,2.1007957559681698E-2,2.0763678983406329E-2,2.0482758620689656E-2,2.016763925729443E-2,1.9820551262830124E-2,1.9443535188216041E-2,1.9038461538461539E-2]
[null,null,null,null,null,null,null,null,null,null,null,null,null,null,null,19,0,3.1179487179487176E-3,5.836554250347353E-3,8.2102724861345556E-3,1.0284088724868336E-2,1.2095490716180372E-2,1.3675968169761273E-2,1.5052166224580018E-2,1.6246782591610175E-2,1.7279272451686242E-2,1.8166407512424158E-2,1.8922723253757736E-2,1.9560879609822879E-2,2.0091954022988506E-2,2.0525681215336388E-2,2.0870650647526915E-2,2.1134470127573576E-2,2.1323902151488359E-2,2.1444978134633308E-2,2.1503094606542882E-2,2.1503094606542882E-2,2.1449336870026522E-2,2.1345754889909641E-2,2.119590754073513E-2,2.1003022638948862E-2,2.0770034563138012E-2,2.0499616858237549E-2,2.0194210587014184E-2,1.9856049062211941E-2,1.9487179487179488E-2,1.9089481946624805E-2]
[null,null,null,null,null,null,null,null,null,null,null,null,null,null,null,20,0,3.0280830280830281E-3,5.68121533638775E-3,8.0083035405374252E-3,1.0050103153551431E-2,1.184084880636605E-2,1.340950826361967E-2,1.4780757769263518E-2,1.5975748389541491E-2,1.7012713802250067E-2,1.7907456528146185E-2,1.8673740053050399E-2,1.9323607427055703E-2,1.9867641936607453E-2,2.0315181775628025E-2,2.0674497915877225E-2,2.0952942332252679E-2,2.1157072191554948E-2,2.1292754432500349E-2,2.1365254256500939E-2,2.1379310344827589E-2,2.1339199068383257E-2,2.1248789524651594E-2,2.1111590895071253E-2,2.0930793344586449E-2,2.070930346792416E-2,2.044977511244378E-2,2.0154636266154977E-2,1.9826112584733279E-2,1.946624803767661E-2,1.9076923076923078E-2]
[null,null,null,null,null,null,null,null,null,null,null,null,null,null,null,21,0,2.9370629370629371E-3,5.5218544573866898E-3,7.7984084880636595E-3,9.8037135278514591E-3,1.1569067537237299E-2,1.3121131741821397E-2,1.4482758620689656E-2,1.567364858684716E-2,1.6710875331564987E-2,1.7609309489176009E-2,1.8381962864721484E-2,1.904027007475283E-2,1.9594320486815416E-2,2.0053050397877987E-2,2.0424403183023871E-2,2.0715463474084161E-2,2.0932570152170878E-2,2.1081411956743523E-2,2.1167108753315646E-2,2.1194280908326323E-2,2.116710875331565E-2,2.1089383751773487E-2,2.0964552688690623E-2,2.0795755968169762E-2,2.0585860915695999E-2,2.0337490829053558E-2,2.0053050397877983E-2,1.9734748010610079E-2,1.9384615384615386E-2,1.9004524886877826E-2]
[null,null,null,null,null,null,null,null,null,null,null,null,null,null,null,22,0,2.8450390189520623E-3,5.3589743589743588E-3,7.5815384615384607E-3,9.5463510848126237E-3,1.1282051282051283E-2,1.2813186813186812E-2,1.4160919540229886E-2,1.534358974358974E-2,1.6377171215880889E-2,1.7275641025641025E-2,1.805128205128205E-2,1.871493212669683E-2,1.9276190476190475E-2,1.9743589743589741E-2,2.0124740124740123E-2,2.0426450742240213E-2,2.0654832347140037E-2,2.0815384615384614E-2,2.0913070669168227E-2,2.0952380952380951E-2,2.0937388193202143E-2,2.0871794871794871E-2,2.075897435897436E-2,2.0602006688963212E-2,2.0403709765411893E-2,2.0166666666666663E-2,1.9893249607535322E-2,1.9585641025641025E-2,1.9245852187028657E-2,1.8875739644970413E-2]
[null,null,null,null,null,null,null,null,null,null,null,null,null,null,null,23,0,2.7521367521367523E-3,5.192997347480105E-3,7.3584982656600692E-3,9.2792350263614636E-3,1.0981432360742704E-2,1.2487697795664502E-2,1.3817624521072797E-2,1.498827757337212E-2,1.6014588859416444E-2,1.6909680357956217E-2,1.7685130285535963E-2,1.8351193633952254E-2,1.891698595146871E-2,1.9390637321671803E-2,1.9779422029875749E-2,2.0089868280849712E-2,2.0327851458885941E-2,2.0498673740053052E-2,2.0607132331270258E-2,2.065757818765036E-2,2.0653966722932238E-2,2.0599901758522447E-2,2.0498673740053052E-2,2.035329307522998E-2,2.0166519304450337E-2,1.9940886699507387E-2,1.9678726790450927E-2,1.9382188242228812E-2,1.9053254437869822E-2,1.8693759071117561E-2]
[null,null,null,null,null,null,null,null,null,null,null,null,null,null,null,24,0,2.6584615384615384E-3,5.0242807590287703E-3,7.1299734748010617E-3,9.00341038272073E-3,1.0668617945669076E-2,1.2146419098143237E-2,1.3454949944382651E-2,1.4610079575596817E-2,1.5625753556788038E-2,1.6514276798252459E-2,1.7286547934823798E-2,1.7952254641909818E-2,1.8520037278657971E-2,1.8997626692726512E-2,1.9391960824321569E-2,1.9709283819628647E-2,1.9955230639839557E-2,2.0134899583175447E-2,2.025291468755783E-2,2.0313479623824456E-2,2.0320424403183025E-2,2.0277245992388421E-2,2.0187143744003617E-2,2.0053050397877987E-2,1.9877659286526284E-2,1.9663448275862069E-2,1.9412700889374319E-2,1.9127524994899003E-2,1.8809869375907114E-2,1.8461538461538463E-2]
[null,null,null,null,null,null,null,null,null,null,null,null,null,null,null,25,0,2.5641025641025641E-3,4.8531289910600248E-3,6.8965517241379309E-3,8.719778042013477E-3,1.0344827586206896E-2,1.1790878754171301E-2,1.3074712643678162E-2,1.4211076280041795E-2,1.5212981744421905E-2,1.6091954022988506E-2,1.6858237547892719E-2,1.7520969245107175E-2,1.808832425892317E-2,1.8567639257294429E-2,1.896551724137931E-2,1.9287917017101204E-2,1.9540229885057471E-2,1.9727345629510826E-2,1.985370950888192E-2,1.9923371647509579E-2,1.9940029985007494E-2,1.9907067742724383E-2,1.9827586206896553E-2,1.9704433497536946E-2,1.9540229885057471E-2,1.9337390128465179E-2,1.9098143236074269E-2,1.8824549989156367E-2,1.8518518518518517E-2,1.8181818181818181E-2]
[null,null,null,null,null,null,null,null,null,null,null,null,null,null,null,26,0,{"$f":"IFERROR(VLOOKUP($P65,$D$15:$E$41,2,FALSE)*VLOOKUP(R$6,$B$15:$C$45,2,FALSE)/($P65+R$38),0)","v":2.4691358024691358E-3},4.6798029556650239E-3,6.6587395957193813E-3,8.4291187739463612E-3,1.0011123470522803E-2,1.1422413793103449E-2,1.2678509230233368E-2,1.379310344827586E-2,1.4778325123152707E-2,1.5644955300127713E-2,1.6402609506057781E-2,1.7059891107078038E-2,1.7624521072796936E-2,1.810344827586207E-2,1.8502943650126155E-2,1.8828680897646416E-2,1.9085805934242181E-2,1.9278996865203762E-2,1.9412515964240099E-2,1.9490254872563718E-2,1.9515774027879677E-2,1.9492337164750958E-2,1.9422941590429278E-2,1.9310344827586208E-2,1.9157088122605366E-2,1.896551724137931E-2,1.8737800910865323E-2,1.8475947211579396E-2,1.8181818181818181E-2,1.7857142857142856E-2]

{"sheet":"Ej. 5","index":4,"n_rows":26,"n_cols":11,"rows_kept":26,"cut":false,"hidden":false,"merged":[[19,1,20,6],[0,8,0,9],[1,1,1,2],[1,3,1,4],[0,1,0,6],[1,5,1,6]]}
[null,"Posibilidades de que te salga un tema que te sepas dependiendo del número de ellos que te sabes",null,null,null,null,null,null,"Simulador de sorteo"]
[null,"Parte A",null,"Parte B",null,"Parte C",null,null,"Tema parte A",{"$f":"_xlfn.CONCAT(\"5.A.\",RANDBETWEEN(1,10))","v":"5.A.1"},{"$f":"VLOOKUP(J2,ListadoDeTemas1[[Tema]:[Nombre del tema]],2,FALSE)","v":"Los regímenes de comercio exterior."}]
[null,"Temas que sabes","Posibilidades","Temas que sabes","Posibilidades","Temas que sabes","Posibilidades",null,"Tema parte B",{"$f":"_xlfn.CONCAT(\"5.B.\",RANDBETWEEN(1,6))","v":"5.B.6"},{"$f":"VLOOKUP(J3,ListadoDeTemas1[[Tema]:[Nombre del tema]],2,FALSE)","v":"Datos de panel. Descripción del problema. El modelo de efectos fijos y de efectos aleatorios. Estimación."}]
[null,10,{"$f":"B4/10","v":1},6,{"$f":"D4/6","v":1},15,{"$f":"F4/15","v":1},null,"Tema parte B",{"$f":"_xlfn.CONCAT(\"5.C.\",RANDBETWEEN(1,15))","v":"5.C.11"},{"$f":"VLOOKUP(J4,ListadoDeTemas1[[Tema]:[Nombre del tema]],2,FALSE)","v":"El Gobierno, su Presidente y el Consejo de Ministros. La Ley de Régimen Jurídico del Sector Público. Objeto y ámbito de aplicación. Principios generales. Organización y funcionamiento de la Administración General del Estado. Organización Central. Órganos Superiores y Directivos. Los Ministerios y su estructura interna. La Organización territorial de la Administración General del Estado. Las Delegaciones y Subdelegaciones del Gobierno."}]
[null,9,{"$f":"B5/10","v":0.9},5,{"$f":"D5/6","v":0.83333333333333337},14,{"$f":"F5/15","v":0.93333333333333335}]
[null,8,0.8,4,0.66666666666666663,13,0.8666666666666667]
[null,7,0.7,3,0.5,12,0.8]
[null,6,0.6,2,0.33333333333333331,11,0.73333333333333328]
[null,5,0.5,1,0.16666666666666666,10,0.66666666666666663]
[null,4,0.4,0,0,9,0.6]
[null,3,0.3,null,null,8,0.53333333333333333]
[null,2,0.2,null,null,7,0.46666666666666667]
[null,1,0.1,null,null,6,0.4]
[null,0,0,null,null,5,0.33333333333333331]
[null,null,null,null,null,4,0.26666666666666666]
[null,null,null,null,null,3,0.2]
[null,null,null,null,null,2,0.13333333333333333]
[null,null,null,null,null,1,6.6666666666666666E-2]
[null,null,null,null,null,0,0]
[null,"* Se elige una bola de cada parte y hay que redactar dos de los tres temas, por lo que lo más eficiente será estudiar dos partes completas."]
[]
[null,null,null,"Temas parte A",10]
[null,null,null,"Temas parte B",6]
[null,null,null,"Temas parte C",0]
[]
[null,null,null,"Probabilidad total",{"$f":"MAX((VLOOKUP($E$22,$B$4:$C$14,2,FALSE)*VLOOKUP($E$23,$D$4:$E$12,2,FALSE)),(VLOOKUP($E$22,$B$4:$C$14,2,FALSE)*VLOOKUP($E$24,$F$4:$G$19,2,FALSE)),(VLOOKUP($E$23,$D$4:$E$12,2,FALSE)*VLOOKUP($E$24,$F$4:$G$19,2,FALSE)))","v":1}]

{"sheet":"Probabilidad de aprobar","index":5,"n_rows":13,"n_cols":7,"rows_kept":13,"cut":false,"hidden":false,"merged":[[2,6,3,6],[5,6,6,6],[8,6,10,6],[12,1,12,3],[11,1,11,2],[7,1,7,2],[4,1,4,2],[2,5,3,5],[5,5,6,5],[8,5,10,5]]}
[]
[null,null,"Temas que sé",null,null,"% de aprobar el ejercicio por tema estudiado","Eficiencia en el ejercicio"]
[null,"Tercer ejercicio. Parte A",38,null,null,{"$f":"$D$5/SUM($C$3:$C$4)","v":1.2605601469237832E-2},{"$f":"$D$5/SUM($C$3:$C$4)/MAX('Ej. 3'!$Q$59:$BI$105)","v":0.94645216891697803}]
[null,"Tercer ejercicio. Parte B",38]
[null,"Posibilidades de aprobar el Tercer ejercicio",null,{"$f":"VLOOKUP($C$4,'Ej. 3'!$P$8:$BI$55,$C$3+2,FALSE)","v":0.95802571166207529}]
[null,"Cuarto ejercicio. Parte A",26,null,null,{"$f":"$D$8/SUM($C$6:$C$7)","v":1.9940886699507387E-2},{"$f":"$D$8/SUM($C$6:$C$7)/MAX('Ej. 4'!$Q$39:$AU$67)","v":0.92414080183156844}]
[null,"Cuarto ejercicio. Parte B",23]
[null,"Posibilidades de aprobar el Cuarto ejercicio",null,{"$f":"VLOOKUP($C$7,'Ej. 4'!$P$6:'Ej. 4'!$AU$35,$C$6+2,FALSE)","v":0.97710344827586204}]
[null,"Quinto ejercicio. Parte A",10,null,null,{"$f":"$D$12/SUM($C$9:$C$11)","v":6.25E-2},{"$f":"$D$12/SUM($C$9:$C$11)/0.0625","v":1}]
[null,"Quinto ejercicio. Parte B",6]
[null,"Quinto ejercicio. Parte C",0]
[null,"Posibilidades de aprobar el Quinto ejercicio",null,{"$f":"MAX((VLOOKUP($C$9,'Ej. 5'!$B$4:$C$14,2,FALSE)*VLOOKUP($C$10,'Ej. 5'!$D$4:$E$12,2,FALSE)),(VLOOKUP($C$9,'Ej. 5'!$B$4:$C$14,2,FALSE)*VLOOKUP($C$11,'Ej. 5'!$F$4:$G$19,2,FALSE)),(VLOOKUP($C$10,'Ej. 5'!$D$4:$E$12,2,FALSE)*VLOOKUP($C$11,'Ej. 5'!$F$4:$G$19,2,FALSE)))","v":1}]
[null,"Probabilidad total de aprobar pasando el test, la coyuntura y los idiomas",null,null,{"$f":"D5*D8*D12","v":0.9360902264019505},{"$f":"E13/SUM(C3:C4,C6:C7,C9:C11)","v":6.638937775900358E-3},{"$f":"F13/0.00663893777590036","v":0.99999999999999978}]

{"sheet":"Sorteos","index":6,"n_rows":1,"n_cols":2,"rows_kept":1,"cut":false,"hidden":false,"merged":[[0,1,3,8]]}
[null,"Sorteos"]

{"sheet":"Simulador de sorteos","index":7,"n_rows":17,"n_cols":13,"rows_kept":17,"cut":false,"hidden":false,"merged":[[10,4,10,12],[13,4,13,12],[14,4,14,12],[15,4,15,12],[16,4,16,12],[11,4,11,12],[12,4,12,12],[2,2,2,5],[2,6,2,9],[2,10,2,12],[7,4,7,12],[8,4,8,12],[3,7,4,7],[3,8,4,8],[10,2,13,2],[14,2,16,2],[1,2,1,12],[6,2,9,2],[5,2,5,12],[3,2,4,2],[3,5,4,5],[3,6,4,6],[3,12,4,12],[3,11,4,11],[3,10,4,10],[3,9,4,9],[3,3,4,3],[3,4,4,4],[6,4,6,12],[9,4,9,12]]}
[]
[null,null,"Simulador de sorteos"]
[null,null,"Tercer ejercicio",null,null,null,"Cuarto ejercicio",null,null,null,"Quinto ejercicio"]
[null,null,{"$f":"'Ej. 3'!$I$2","v":"3.A.11"},{"$f":"'Ej. 3'!I3","v":"3.A.14"},{"$f":"'Ej. 3'!I4","v":"3.B.12"},{"$f":"'Ej. 3'!$I$5","v":"3.B.4"},{"$f":"'Ej. 4'!$I$2","v":"4.A.21"},{"$f":"'Ej. 4'!$I$3","v":"4.A.9"},{"$f":"'Ej. 4'!$I$4","v":"4.B.18"},{"$f":"'Ej. 4'!$I$5","v":"4.B.14"},{"$f":"'Ej. 5'!J2","v":"5.A.1"},{"$f":"'Ej. 5'!J3","v":"5.B.6"},{"$f":"'Ej. 5'!J4","v":"5.C.11"}]
[]
[]
[null,null,"Tercer ejercicio",{"$f":"C4","v":"3.A.11"},{"$f":"IF(VLOOKUP(D7,'Listado de temas'!$E$3:$F$179,2,FALSE)=0,\"\",VLOOKUP(D7,'Listado de temas'!$E$3:$F$179,2,FALSE))","v":"Teoría de la producción. Caracterización de la tecnología de la empresa a corto y largo plazo. El conjunto de posibilidades de producción. La función de producción. Rendimientos locales y globales a escala. Elasticidad de sustitución. Producción conjunta. "}]
[null,null,null,{"$f":"D4","v":"3.A.14"},{"$f":"IF(VLOOKUP(D8,'Listado de temas'!$E$3:$F$179,2,FALSE)=0,\"\",VLOOKUP(D8,'Listado de temas'!$E$3:$F$179,2,FALSE))","v":"Teoría de juegos. Principales conceptos. Aplicaciones, con especial referencia a las subastas."}]
[null,null,null,{"$f":"E4","v":"3.B.12"},{"$f":"IF(VLOOKUP(D9,'Listado de temas'!$E$3:$F$179,2,FALSE)=0,\"\",VLOOKUP(D9,'Listado de temas'!$E$3:$F$179,2,FALSE))","v":"Mecanismos de ajuste de la balanza de pagos. Especial referencia al enfoque intertemporal de balanza de pagos. Análisis de sostenibilidad del déficit y de la deuda exterior."}]
[null,null,null,{"$f":"'Ej. 3'!$I$5","v":"3.B.4"},{"$f":"IF(VLOOKUP(D10,'Listado de temas'!$E$3:$F$179,2,FALSE)=0,\"\",VLOOKUP(D10,'Listado de temas'!$E$3:$F$179,2,FALSE))","v":"Análisis del crecimiento de la empresa. Métodos de valoración de empresas. Especial referencia a los procesos de fusión, adquisición y alianzas estratégicas."}]
[null,null,"Cuarto ejercicio",{"$f":"G4","v":"4.A.21"},{"$f":"IF(VLOOKUP(D11,'Listado de temas'!$E$3:$F$179,2,FALSE)=0,\"\",VLOOKUP(D11,'Listado de temas'!$E$3:$F$179,2,FALSE))","v":"Análisis de la evolución de la balanza de pagos y de la Posición de Inversión Internacional de España desde la adopción del euro. Posición neta del Banco de España frente al Eurosistema. La sostenibilidad externa."}]
[null,null,null,{"$f":"H4","v":"4.A.9"},{"$f":"IF(VLOOKUP(D12,'Listado de temas'!$E$3:$F$179,2,FALSE)=0,\"\",VLOOKUP(D12,'Listado de temas'!$E$3:$F$179,2,FALSE))","v":"Análisis de la industria en España. Características y situación actual. Los retos de la industria y la política industrial en España en el contexto de las economías desarrolladas. La estrategia de la UE."}]
[null,null,null,{"$f":"I4","v":"4.B.18"},{"$f":"IF(VLOOKUP(D13,'Listado de temas'!$E$3:$F$179,2,FALSE)=0,\"\",VLOOKUP(D13,'Listado de temas'!$E$3:$F$179,2,FALSE))","v":"Fiscalidad internacional. El Impuesto sobre la Renta de no Residentes en España. Convenios de doble imposición, con especial referencia al modelo de la OCDE. El problema de la erosión de bases imponibles y propuestas de solución."}]
[null,null,null,{"$f":"J4","v":"4.B.14"},{"$f":"IF(VLOOKUP(D14,'Listado de temas'!$E$3:$F$179,2,FALSE)=0,\"\",VLOOKUP(D14,'Listado de temas'!$E$3:$F$179,2,FALSE))","v":"La teoría del federalismo fiscal: la asignación óptima de las funciones entre los distintos niveles de gobierno para alcanzar el bienestar máximo. La financiación de las haciendas territoriales: impuestos, transferencias y deuda."}]
[null,null,"Quinto ejercicio",{"$f":"K4","v":"5.A.1"},{"$f":"IF(VLOOKUP(D15,'Listado de temas'!$E$3:$F$179,2,FALSE)=0,\"\",VLOOKUP(D15,'Listado de temas'!$E$3:$F$179,2,FALSE))","v":"Los regímenes de comercio exterior."}]
[null,null,null,{"$f":"L4","v":"5.B.6"},{"$f":"IF(VLOOKUP(D16,'Listado de temas'!$E$3:$F$179,2,FALSE)=0,\"\",VLOOKUP(D16,'Listado de temas'!$E$3:$F$179,2,FALSE))","v":"Datos de panel. Descripción del problema. El modelo de efectos fijos y de efectos aleatorios. Estimación."}]
[null,null,null,{"$f":"M4","v":"5.C.11"},{"$f":"IF(VLOOKUP(D17,'Listado de temas'!$E$3:$F$179,2,FALSE)=0,\"\",VLOOKUP(D17,'Listado de temas'!$E$3:$F$179,2,FALSE))","v":"El Gobierno, su Presidente y el Consejo de Ministros. La Ley de Régimen Jurídico del Sector Público. Objeto y ámbito de aplicación. Principios generales. Organización y funcionamiento de la Administración General del Estado. Organización Central. Órganos Superiores y Directivos. Los Ministerios y su estructura interna. La Organización territorial de la Administración General del Estado. Las Delegaciones y Subdelegaciones del Gobierno."}]

{"sheet":"Sorteo de temas predefinidos","index":8,"n_rows":95,"n_cols":10,"rows_kept":95,"cut":false,"hidden":false,"merged":[[3,2,3,9],[4,8,4,9],[1,2,1,7]]}
[]
[null,null,"Buscar título del tema: ",null,null,null,null,null,"3.A.25",{"$f":"IF(VLOOKUP(I2,'Listado de temas'!$E$3:$F$179,2,FALSE)=0,\"\",VLOOKUP(I2,'Listado de temas'!$E$3:$F$179,2,FALSE))","v":"La teoría neoclásica del mercado de trabajo. Análisis intertemporal de la oferta de trabajo. Teoría del capital humano. Función de ingresos de capital humano y evidencia empírica."}]
[]
[null,null,"Sorteo de temas predefinidos"]
[null,null,"#",null,"Temas a incluir en el sorteo:",null,null,"Cuántos temas obtener como resultado","RESULTADO"]
[null,null,1,{"$f":"RAND()","v":0.75549963476597404},"3.B.3",0,{"$f":"CELL(\"fila\",G6)-1","v":5},2,{"$f":"VLOOKUP(RANDBETWEEN(1,(VLOOKUP(\"-\",$E$6:$G$95,2,FALSE))),$C$6:$E$95,3,FALSE)","v":"3.A.21"},{"$f":"IF(VLOOKUP(I6,'Listado de temas'!$E$3:$F$179,2,FALSE)=0,\"\",VLOOKUP(I6,'Listado de temas'!$E$3:$F$179,2,FALSE))","v":"La teoría del equilibrio general."}]
[null,null,2,{"$f":"RAND()","v":0.30546328491791075},"3.B.4",1,{"$f":"CELL(\"fila\",G7)-1","v":6},null,"3.A.44",{"$f":"IF(VLOOKUP(I7,'Listado de temas'!$E$3:$F$179,2,FALSE)=0,\"\",VLOOKUP(I7,'Listado de temas'!$E$3:$F$179,2,FALSE))","v":"Crecimiento económico (II). Modelos de crecimiento endógeno: rendimientos crecientes, capital humano e innovación tecnológica."}]
[null,null,3,{"$f":"RAND()","v":0.26563147559375078},"3.B.6",2,{"$f":"CELL(\"fila\",G8)-1","v":7},null,"3.A.42",{"$f":"IF(VLOOKUP(I8,'Listado de temas'!$E$3:$F$179,2,FALSE)=0,\"\",VLOOKUP(I8,'Listado de temas'!$E$3:$F$179,2,FALSE))","v":"Teorías de los ciclos económicos: ciclos nominales y reales. Referencia al ciclo financiero y sus interrelaciones con el ciclo real."}]
[null,null,4,0.51666062941923718,"3.B.8",3,{"$f":"CELL(\"fila\",G9)-1","v":8},null,"3.A.17",{"$f":"IF(VLOOKUP(I9,'Listado de temas'!$E$3:$F$179,2,FALSE)=0,\"\",VLOOKUP(I9,'Listado de temas'!$E$3:$F$179,2,FALSE))","v":"Análisis de mercados (II). Teoría del monopolio. Discriminación de precios. Monopolio natural. Producción conjunta. Análisis de eficiencia y bienestar. Monopsonio. Monopolio bilateral."}]
[null,null,5,0.42348595226805608,"3.A.7",4,{"$f":"CELL(\"fila\",G10)-1","v":9},null,"3.B.7",{"$f":"IF(VLOOKUP(I10,'Listado de temas'!$E$3:$F$179,2,FALSE)=0,\"\",VLOOKUP(I10,'Listado de temas'!$E$3:$F$179,2,FALSE))","v":"La política comercial (I). Instrumentos y efectos. Barreras arancelarias y no arancelarias. Otros instrumentos tradicionales."}]
[null,null,6,0.4569760222197915,"3.A.14",5,{"$f":"CELL(\"fila\",G11)-1","v":10},null,"3.A.9",{"$f":"IF(VLOOKUP(I11,'Listado de temas'!$E$3:$F$179,2,FALSE)=0,\"\",VLOOKUP(I11,'Listado de temas'!$E$3:$F$179,2,FALSE))","v":"Teoría de la demanda del consumidor (II). Dualidad e integrabilidad de las preferencias. Sistemas de demanda utilizados en estudios empíricos. Medidas de cambio en el bienestar."}]
[null,null,7,0.4540766961938445,"3.A.21",6,{"$f":"CELL(\"fila\",G12)-1","v":11},null,"3.A.14",{"$f":"IF(VLOOKUP(I12,'Listado de temas'!$E$3:$F$179,2,FALSE)=0,\"\",VLOOKUP(I12,'Listado de temas'!$E$3:$F$179,2,FALSE))","v":"Teoría de juegos. Principales conceptos. Aplicaciones, con especial referencia a las subastas."}]
[null,null,8,0.88803885024019891,"3.A.42",7,{"$f":"CELL(\"fila\",G13)-1","v":12},null,"3.B.7",{"$f":"IF(VLOOKUP(I13,'Listado de temas'!$E$3:$F$179,2,FALSE)=0,\"\",VLOOKUP(I13,'Listado de temas'!$E$3:$F$179,2,FALSE))","v":"La política comercial (I). Instrumentos y efectos. Barreras arancelarias y no arancelarias. Otros instrumentos tradicionales."}]
[null,null,9,0.19866194443456775,"3.B.34",8,{"$f":"CELL(\"fila\",G14)-1","v":13},null,"3.A.22",{"$f":"IF(VLOOKUP(I14,'Listado de temas'!$E$3:$F$179,2,FALSE)=0,\"\",VLOOKUP(I14,'Listado de temas'!$E$3:$F$179,2,FALSE))","v":"Economía del bienestar (I). Los teoremas fundamentales del bienestar. Óptimo económico y «second best»."}]
[null,null,10,0.33253174791583551,"3.B.35",9,{"$f":"CELL(\"fila\",G15)-1","v":14},null,"3.B.7",{"$f":"IF(VLOOKUP(I15,'Listado de temas'!$E$3:$F$179,2,FALSE)=0,\"\",VLOOKUP(I15,'Listado de temas'!$E$3:$F$179,2,FALSE))","v":"La política comercial (I). Instrumentos y efectos. Barreras arancelarias y no arancelarias. Otros instrumentos tradicionales."}]
[null,null,11,0.30806151570369855,"3.B.5",10,{"$f":"CELL(\"fila\",G16)-1","v":15}]
[null,null,12,0.56600664135951029,"3.A.15",11,{"$f":"CELL(\"fila\",G17)-1","v":16}]
[null,null,13,0.29031140225181262,"3.B.7",12,{"$f":"CELL(\"fila\",G18)-1","v":17}]
[null,null,14,0.20166680301631945,"3.A.16",13,{"$f":"CELL(\"fila\",G19)-1","v":18}]
[null,null,15,0.47248502672917292,"3.B.9",14,{"$f":"CELL(\"fila\",G20)-1","v":19}]
[null,null,16,0.82797927403238214,"3.B.10",15,{"$f":"CELL(\"fila\",G21)-1","v":20}]
[null,null,17,0.3888100103661688,"3.A.12",16,{"$f":"CELL(\"fila\",G22)-1","v":21}]
[null,null,18,0.4203857821774124,"3.A.17",17,{"$f":"CELL(\"fila\",G23)-1","v":22}]
[null,null,19,0.56253077649948469,"3.A.43",18,{"$f":"CELL(\"fila\",G24)-1","v":23}]
[null,null,20,0.9639002767308511,"3.A.44",19,{"$f":"CELL(\"fila\",G25)-1","v":24}]
[null,null,21,0.55886983738392992,"3.A.6",20,{"$f":"CELL(\"fila\",G26)-1","v":25}]
[null,null,22,0.98802133947785009,"3.A.8",21,{"$f":"CELL(\"fila\",G27)-1","v":26}]
[null,null,23,0.32721474748520041,"3.A.22",22,{"$f":"CELL(\"fila\",G28)-1","v":27}]
[null,null,24,0.77132535064771213,"3.A.13",23,{"$f":"CELL(\"fila\",G29)-1","v":28}]
[null,null,25,0.47974219418738939,"3.A.9",24,{"$f":"CELL(\"fila\",G30)-1","v":29}]
[null,null,26,0.77689886926435092,"3.A.10",25,{"$f":"CELL(\"fila\",G31)-1","v":30}]
[null,null,27,0.84251919407288212,"3.A.23",26,{"$f":"CELL(\"fila\",G32)-1","v":31}]
[null,null,28,0.8579097178243873,"3.B.2",27,{"$f":"CELL(\"fila\",G33)-1","v":32}]
[null,null,29,0.14032514530553786,"3.B.21",28,{"$f":"CELL(\"fila\",G34)-1","v":33}]
[null,null,30,0.70492664928279647,"3.B.22",29,{"$f":"CELL(\"fila\",G35)-1","v":34}]
[null,null,31,0.55390336545100149,"-",30,{"$f":"CELL(\"fila\",G36)-1","v":35}]
[null,null,32,0.59241004611684156,"-",31,{"$f":"CELL(\"fila\",G37)-1","v":36}]
[null,null,33,0.85218595788794516,"-",32,{"$f":"CELL(\"fila\",G38)-1","v":37}]
[null,null,34,0.32128736396727642,"-",33,{"$f":"CELL(\"fila\",G39)-1","v":38}]
[null,null,35,0.45613125391636922,"-",34,{"$f":"CELL(\"fila\",G40)-1","v":39}]
[null,null,36,0.7718379204241661,"-",35,{"$f":"CELL(\"fila\",G41)-1","v":40}]
[null,null,37,0.3529483220098667,"-",36,{"$f":"CELL(\"fila\",G42)-1","v":41}]
[null,null,38,0.48863006996179992,"-",37,{"$f":"CELL(\"fila\",G43)-1","v":42}]
[null,null,39,3.6001786517372292E-3,"-",38,{"$f":"CELL(\"fila\",G44)-1","v":43}]
[null,null,40,0.39760659032734647,"-",39,{"$f":"CELL(\"fila\",G45)-1","v":44}]
[null,null,41,0.93306996453345958,"-",40,{"$f":"CELL(\"fila\",G46)-1","v":45}]
[null,null,42,0.56229617376485186,"-",41,{"$f":"CELL(\"fila\",G47)-1","v":46}]
[null,null,43,0.97530881886816745,"-",42,{"$f":"CELL(\"fila\",G48)-1","v":47}]
[null,null,44,0.6594843950053072,"-",43,{"$f":"CELL(\"fila\",G49)-1","v":48}]
[null,null,45,0.82143066786838004,"-",44,{"$f":"CELL(\"fila\",G50)-1","v":49}]
[null,null,46,0.91630763341347987,"-",45,{"$f":"CELL(\"fila\",G51)-1","v":50}]
[null,null,47,0.91089228997299121,"-",46,{"$f":"CELL(\"fila\",G52)-1","v":51}]
[null,null,48,0.66464430297381283,"-",47,{"$f":"CELL(\"fila\",G53)-1","v":52}]
[null,null,49,0.91269775867576208,"-",48,{"$f":"CELL(\"fila\",G54)-1","v":53}]
[null,null,50,0.27184303158586032,"-",49,{"$f":"CELL(\"fila\",G55)-1","v":54}]
[null,null,51,0.28910120442978759,"-",50,{"$f":"CELL(\"fila\",G56)-1","v":55}]
[null,null,52,0.31974971177969613,"-",51,{"$f":"CELL(\"fila\",G57)-1","v":56}]
[null,null,53,0.46445533376847847,"-",52,{"$f":"CELL(\"fila\",G58)-1","v":57}]
[null,null,54,0.81137043414152388,"-",53,{"$f":"CELL(\"fila\",G59)-1","v":58}]
[null,null,55,0.51356126549439496,"-",54,{"$f":"CELL(\"fila\",G60)-1","v":59}]
[null,null,56,0.36907907052225541,"-",55,{"$f":"CELL(\"fila\",G61)-1","v":60}]
[null,null,57,0.9444985916680223,"-",56,{"$f":"CELL(\"fila\",G62)-1","v":61}]
[null,null,58,0.70848848897103589,"-",57,{"$f":"CELL(\"fila\",G63)-1","v":62}]
[null,null,59,0.80516764385703521,"-",58,{"$f":"CELL(\"fila\",G64)-1","v":63}]
[null,null,60,0.13300033386897825,"-",59,{"$f":"CELL(\"fila\",G65)-1","v":64}]
[null,null,61,0.114540214477587,"-",60,{"$f":"CELL(\"fila\",G66)-1","v":65}]
[null,null,62,0.99998610667104681,"-",61,{"$f":"CELL(\"fila\",G67)-1","v":66}]
[null,null,63,0.48522252762908957,"-",62,{"$f":"CELL(\"fila\",G68)-1","v":67}]
[null,null,64,0.68936342435163922,"-",63,{"$f":"CELL(\"fila\",G69)-1","v":68}]
[null,null,65,0.42929024808570548,"-",64,{"$f":"CELL(\"fila\",G70)-1","v":69}]
[null,null,66,0.30312813501697744,"-",65,{"$f":"CELL(\"fila\",G71)-1","v":70}]
[null,null,67,{"$f":"RAND()","v":0.87435485558026915},"-",66,{"$f":"CELL(\"fila\",G72)-1","v":71}]
[null,null,68,0.28852858366625678,"-",67,{"$f":"CELL(\"fila\",G73)-1","v":72}]
[null,null,69,0.39442925577536658,"-",68,{"$f":"CELL(\"fila\",G74)-1","v":73}]
[null,null,70,0.9928608388972997,"-",69,{"$f":"CELL(\"fila\",G75)-1","v":74}]
[null,null,71,0.23025454294510583,"-",70,{"$f":"CELL(\"fila\",G76)-1","v":75}]
[null,null,72,0.46840470078058694,"-",71,{"$f":"CELL(\"fila\",G77)-1","v":76}]
[null,null,73,3.5169729084677304E-2,"-",72,{"$f":"CELL(\"fila\",G78)-1","v":77}]
[null,null,74,8.5128072789373288E-3,"-",73,{"$f":"CELL(\"fila\",G79)-1","v":78}]
[null,null,75,0.21623268317088251,"-",74,{"$f":"CELL(\"fila\",G80)-1","v":79}]
[null,null,76,5.6891647391260292E-2,"-",75,{"$f":"CELL(\"fila\",G81)-1","v":80}]
[null,null,77,9.5738865858897682E-2,"-",76,{"$f":"CELL(\"fila\",G82)-1","v":81}]
[null,null,78,0.42220170500034504,"-",77,{"$f":"CELL(\"fila\",G83)-1","v":82}]
[null,null,79,0.91649782836378135,"-",78,{"$f":"CELL(\"fila\",G84)-1","v":83}]
[null,null,80,0.3306470355260942,"-",79,{"$f":"CELL(\"fila\",G85)-1","v":84}]
[null,null,81,0.746884658901939,"-",80,{"$f":"CELL(\"fila\",G86)-1","v":85}]
[null,null,82,0.65644836501288184,"-",81,{"$f":"CELL(\"fila\",G87)-1","v":86}]
[null,null,83,0.21700808312893904,"-",82,{"$f":"CELL(\"fila\",G88)-1","v":87}]
[null,null,84,0.49673729327797922,"-",83,{"$f":"CELL(\"fila\",G89)-1","v":88}]
[null,null,85,0.48049164113699572,"-",84,{"$f":"CELL(\"fila\",G90)-1","v":89}]
[null,null,86,0.82931782746696558,"-",85,{"$f":"CELL(\"fila\",G91)-1","v":90}]
[null,null,87,0.19612522826262635,"-",86,{"$f":"CELL(\"fila\",G92)-1","v":91}]
[null,null,88,0.59073114255825132,"-",87,{"$f":"CELL(\"fila\",G93)-1","v":92}]
[null,null,89,0.35751975784369461,"-",88,{"$f":"CELL(\"fila\",G94)-1","v":93}]
[null,null,90,{"$f":"RAND()","v":0.56280626720638294},"-",89,{"$f":"CELL(\"fila\",G95)-1","v":94}]

{"sheet":"Temario","index":9,"n_rows":1,"n_cols":2,"rows_kept":1,"cut":false,"hidden":false,"merged":[[0,1,3,8]]}
[null,"Temario"]

{"sheet":"Listado de temas","index":10,"n_rows":179,"n_cols":8,"rows_kept":179,"cut":false,"hidden":false,"merged":[[0,0,0,7]]}
["Listado de temas"]
[null,"Ejercicio","Parte","Número","Tema","Nombre del tema","Categoría","Bloque"]
[null,3,"A",1,{"$f":"_xlfn.CONCAT(B3,\".\",C3,\".\",D3)","v":"3.A.1"},"Objeto y métodos de la ciencia económica. Cuestiones y debates actuales, con especial referencia a la economía conductual.","Mixto","Pensamiento económico"]
[null,3,"A",2,"3.A.2","Los economistas clásicos y Marx.","Mixto","Pensamiento económico"]
[null,3,"A",3,"3.A.3","Los economistas neoclásicos.","Mixto","Pensamiento económico"]
[null,3,"A",4,"3.A.4","El pensamiento económico de Keynes. Referencia a la economía post-keynesiana y el desequilibrio.","Mixto","Pensamiento económico"]
[null,3,"A",5,"3.A.5","La síntesis neoclásica. El monetarismo.","Mixto","Pensamiento económico"]
[null,3,"A",6,"3.A.6","La nueva macroeconomía clásica. La hipótesis de las expectativas racionales; la crítica de Lucas; el surgimiento de los modelos dinámicos estocásticos de equilibrio general.","Mixto","Pensamiento económico"]
[null,3,"A",7,"3.A.7","La nueva economía keynesiana. Primera y segunda generación.","Mixto","Pensamiento económico"]
[null,3,"A",8,"3.A.8","Teoría de la demanda del consumidor (I). Axiomas sobre las preferencias, función de utilidad y función de demanda marshalliana. La teoría de la preferencia revelada. Precios hedónicos.","Microeconomía","Modelo neoclásico básico"]
[null,3,"A",9,"3.A.9","Teoría de la demanda del consumidor (II). Dualidad e integrabilidad de las preferencias. Sistemas de demanda utilizados en estudios empíricos. Medidas de cambio en el bienestar.","Microeconomía","Modelo neoclásico básico"]
[null,3,"A",10,"3.A.10","Teoría de la demanda del consumidor (III). Elección del consumidor en situaciones de riesgo e incertidumbre.","Microeconomía","Información y poder de mercado"]
[null,3,"A",11,"3.A.11","Teoría de la producción. Caracterización de la tecnología de la empresa a corto y largo plazo. El conjunto de posibilidades de producción. La función de producción. Rendimientos locales y globales a escala. Elasticidad de sustitución. Producción conjunta. ","Microeconomía","Modelo neoclásico básico"]
[null,3,"A",12,"3.A.12","Teoría de los costes. Análisis de dualidad en el ámbito de la empresa. Aplicaciones empíricas.","Microeconomía","Modelo neoclásico básico"]
[null,3,"A",13,"3.A.13","Economía de la información y teoría de la agencia: selección adversa y riesgo moral.","Microeconomía","Información y poder de mercado"]
[null,3,"A",14,"3.A.14","Teoría de juegos. Principales conceptos. Aplicaciones, con especial referencia a las subastas.","Microeconomía","Información y poder de mercado"]
[null,3,"A",15,"3.A.15","La empresa: el tamaño eficiente y sus límites. Mención especial de la economía de los costes de transacción. La Teoría de la Organización Industrial: barreras a la entrada y mercados impugnables.","Microeconomía","Información y poder de mercado"]
[null,3,"A",16,"3.A.16","Análisis de mercados (I). El modelo de competencia perfecta. Análisis de equilibrio parcial: corto y largo plazo; dinámicas de ajuste y estabilidad del equilibrio. Análisis de eficiencia y bienestar. ","Microeconomía","Modelo neoclásico básico"]
[null,3,"A",17,"3.A.17","Análisis de mercados (II). Teoría del monopolio. Discriminación de precios. Monopolio natural. Producción conjunta. Análisis de eficiencia y bienestar. Monopsonio. Monopolio bilateral.","Microeconomía","Información y poder de mercado"]
[null,3,"A",18,"3.A.18","Análisis de mercados (III). Diferenciación de productos: la teoría de la competencia monopolística y otros desarrollos.","Microeconomía","Información y poder de mercado"]
[null,3,"A",19,"3.A.19","Análisis de mercados (IV). Teoría del oligopolio: soluciones no cooperativas y soluciones cooperativas.","Microeconomía","Información y poder de mercado"]
[null,3,"A",20,"3.A.20","Poder de mercado y regulación óptima. Definición del mercado relevante. Desarrollos en presencia de información asimétrica. Aplicaciones prácticas.","Microeconomía","Información y poder de mercado"]
[null,3,"A",21,"3.A.21","La teoría del equilibrio general.","Microeconomía","Modelo neoclásico básico"]
[null,3,"A",22,"3.A.22","Economía del bienestar (I). Los teoremas fundamentales del bienestar. Óptimo económico y «second best».","Microeconomía","Economía del Bienestar e Intervención del Sector Público"]
[null,3,"A",23,"3.A.23","Economía del bienestar (II). Fallos de mercado: externalidades y bienes públicos. Intervención y fallos del sector público.","Microeconomía","Economía del Bienestar e Intervención del Sector Público"]
[null,3,"A",24,"3.A.24","Economía del bienestar (III). Las funciones de bienestar social. Teoría de la elección colectiva. El teorema de la imposibilidad de Arrow y desarrollos posteriores.","Microeconomía","Economía del Bienestar e Intervención del Sector Público"]
[null,3,"A",25,"3.A.25","La teoría neoclásica del mercado de trabajo. Análisis intertemporal de la oferta de trabajo. Teoría del capital humano. Función de ingresos de capital humano y evidencia empírica.","Macroeconomía","Demanda Agregada y Oferta Agregada"]
[null,3,"A",26,"3.A.26","Desempleo friccional. La curva de Beveridge, el modelo de búsqueda y emparejamiento de Diamond, Mortensen y Pissarides. Costes de ajuste y dinámica de la demanda de trabajo.","Macroeconomía","Demanda Agregada y Oferta Agregada"]
[null,3,"A",27,"3.A.27","Determinación de salarios: modelos de negociación, salarios de eficiencia y contratos implícitos.","Macroeconomía","Demanda Agregada y Oferta Agregada"]
[null,3,"A",28,"3.A.28","La tasa natural de paro y la NAIRU. La persistencia del desempleo.","Macroeconomía","Demanda Agregada y Oferta Agregada"]
[null,3,"A",29,"3.A.29","Modelización dinámica de las tomas de decisiones. Modelos de horizonte infinito y modelos de generaciones solapadas.","Macroeconomía","Crecimiento económico"]
[null,3,"A",30,"3.A.30","Magnitudes macroeconómicas y contabilidad nacional.","Macroeconomía","Contabilidad Nacional"]
[null,3,"A",31,"3.A.31","Análisis de las tablas «input-output».","Macroeconomía","Contabilidad Nacional"]
[null,3,"A",32,"3.A.32","El modelo de oferta y demanda agregada: determinación de renta e inflación en una economía abierta. Análisis de las políticas monetaria y fiscal, y de los shocks y políticas de oferta.","Macroeconomía","Demanda Agregada y Oferta Agregada"]
[null,3,"A",33,{"$f":"_xlfn.CONCAT(B35,\".\",C35,\".\",D35)","v":"3.A.33"},"Teorías de la demanda de consumo corriente: ciclo vital y renta permanente. La demanda de bienes de consumo duradero. Evidencia empírica e implicaciones de política económica.","Macroeconomía","Demanda Agregada y Oferta Agregada"]
[null,3,"A",34,"3.A.34","Teorías de la inversión en bienes de equipo. Incertidumbre e irreversibilidad de la inversión. Implicaciones de política económica.","Macroeconomía","Demanda Agregada y Oferta Agregada"]
[null,3,"A",35,"3.A.35","Teorías de la demanda de dinero. Implicaciones de política económica.","Macroeconomía","Ciclo económico y políticas de demanda"]
[null,3,"A",36,"3.A.36","La política monetaria (I). El diseño y la instrumentación de la política monetaria.","Macroeconomía","Ciclo económico y políticas de demanda"]
[null,3,"A",37,"3.A.37","La política monetaria (II).  Los mecanismos de transmisión de la política monetaria convencional. Rigideces de precios, rigideces de salarios y fricciones financieras. Los mecanismos de transmisión de la política monetaria no convencional.","Macroeconomía","Ciclo económico y políticas de demanda"]
[null,3,"A",38,"3.A.38","La política fiscal: efectos sobre el crecimiento económico y el ahorro.","Macroeconomía","Ciclo económico y políticas de demanda"]
[null,3,"A",39,"3.A.39","Déficit público. Conceptos. Financiación y sus consecuencias macroeconómicas. Dominación monetaria y dominación fiscal. La dinámica de la deuda pública y su sostenibilidad.","Macroeconomía","Ciclo económico y políticas de demanda"]
[null,3,"A",40,"3.A.40","Efectividad e interrelación de las políticas monetaria y fiscal en las principales economías desarrolladas desde la Gran Recesión de 2008. El valor de los multiplicadores fiscales.","Macroeconomía","Ciclo económico y políticas de demanda"]
[null,3,"A",41,"3.A.41","La inflación: causas y sus efectos sobre la eficiencia económica y el bienestar. Hiperinflación y deflación.","Macroeconomía","Ciclo económico y políticas de demanda"]
[null,3,"A",42,"3.A.42","Teorías de los ciclos económicos: ciclos nominales y reales. Referencia al ciclo financiero y sus interrelaciones con el ciclo real.","Macroeconomía","Ciclo económico y políticas de demanda"]
[null,3,"A",43,"3.A.43","Crecimiento económico (I). Acumulación de capital y progreso técnico exógeno. El modelo de Solow. El modelo de Solow aumentado con acumulación de capital humano. El modelo de Ramsey-Cass-Koopmans.","Macroeconomía","Crecimiento económico"]
[null,3,"A",44,"3.A.44","Crecimiento económico (II). Modelos de crecimiento endógeno: rendimientos crecientes, capital humano e innovación tecnológica.","Macroeconomía","Crecimiento económico"]
[null,3,"A",45,"3.A.45","Evidencia empírica sobre el crecimiento económico y la distribución de la renta entre los factores de producción. Contabilidad del crecimiento, con especial referencia a la productividad total de los factores. Convergencia económica internacional.","Macroeconomía","Crecimiento económico"]
[null,3,"B",1,"3.B.1","La información financiera de las empresas: estados de situación y de circulación. Métodos de análisis económico y financiero de la empresa.","Microeconomía","Economía financiera y corporativa"]
[null,3,"B",2,"3.B.2","La empresa y las decisiones de inversión. Diferentes criterios de valoración de proyectos. Rentabilidad, riesgo y coste del capital.","Microeconomía","Economía financiera y corporativa"]
[null,3,"B",3,"3.B.3","La empresa y las decisiones de financiación: Financiación propia frente a financiación ajena. Política de dividendos y estructura del capital.","Microeconomía","Economía financiera y corporativa"]
[null,3,"B",4,"3.B.4","Análisis del crecimiento de la empresa. Métodos de valoración de empresas. Especial referencia a los procesos de fusión, adquisición y alianzas estratégicas.","Microeconomía","Economía financiera y corporativa"]
[null,3,"B",5,"3.B.5","Teoría del comercio internacional (I). La teoría ricardiana de la ventaja comparativa. Determinación de la relación real de intercambio. El modelo de factores específicos. El Modelo Hecksher-Ohlin-Samuelson (H-O-S); teoremas derivados del modelo y extensiones.","Microeconomía","Comercio Internacional"]
[null,3,"B",6,"3.B.6","Teoría del comercio internacional (II). Desarrollos recientes. Nueva teoría del comercio internacional. Especial referencia a la competencia imperfecta, los rendimientos crecientes y la heterogeneidad empresarial.","Microeconomía","Comercio Internacional"]
[null,3,"B",7,"3.B.7","La política comercial (I). Instrumentos y efectos. Barreras arancelarias y no arancelarias. Otros instrumentos tradicionales.","Microeconomía","Comercio Internacional"]
[null,3,"B",8,"3.B.8","La política comercial (II). La política comercial estratégica. La política de promoción exterior: justificación, instrumentos y objetivos.","Microeconomía","Comercio Internacional"]
[null,3,"B",9,"3.B.9","Comercio internacional y crecimiento económico. Especial referencia a los efectos del comercio sobre el crecimiento.","Microeconomía","Comercio Internacional"]
[null,3,"B",10,"3.B.10","Teoría de la integración económica.","Microeconomía","Comercio Internacional"]
[null,3,"B",11,"3.B.11","Balanza de pagos: concepto, medición e interpretación.","Macroeconomía","Contabilidad Nacional"]
[null,3,"B",12,"3.B.12","Mecanismos de ajuste de la balanza de pagos. Especial referencia al enfoque intertemporal de balanza de pagos. Análisis de sostenibilidad del déficit y de la deuda exterior.","Macroeconomía","Economía abierta"]
[null,3,"B",13,"3.B.13","Mercado de divisas. Operaciones e instrumentos.","Microeconomía","Economía financiera y corporativa"]
[null,3,"B",14,"3.B.14","Teorías de la determinación del tipo de cambio.","Macroeconomía","Economía abierta"]
[null,3,"B",15,"3.B.15","Análisis comparado de los distintos regímenes cambiarios. Intervención y regulación en los mercados de cambio.","Macroeconomía","Economía abierta"]
[null,3,"B",16,"3.B.16","Teoría de la integración monetaria.","Macroeconomía","Economía abierta"]
[null,3,"B",17,"3.B.17","Teorías explicativas de las crisis de balanza de pagos.","Macroeconomía","Economía abierta"]
[null,3,"B",18,"3.B.18","La nueva globalización económica y financiera. Determinantes y efectos de los movimientos internacionales de factores productivos: movilidad de trabajadores, inversión de cartera e inversión directa, con especial referencia a las cadenas globales de valor.","Macroeconomía","Economía abierta"]
[null,3,"B",19,"3.B.19","La coordinación internacional de políticas económicas. Aspectos teóricos y prácticos. El G-20, la OCDE y otros foros internacionales.","Macroeconomía","Economía abierta"]
[null,3,"B",20,"3.B.20","El sistema económico internacional desde el siglo XIX hasta la ruptura del sistema de Bretton-Woods.","Mixto","Historia económica"]
[null,3,"B",21,{"$f":"_xlfn.CONCAT(B68,\".\",C68,\".\",D68)","v":"3.B.21"},"El sistema económico internacional desde la desaparición del sistema de Bretton-Woods.","Mixto","Historia económica"]
[null,3,"B",22,"3.B.22","El Fondo Monetario Internacional. Estructura y políticas. La prevención y solución de crisis.","Mixto","Organismos internacionales"]
[null,3,"B",23,"3.B.23","Análisis de los instrumentos financieros de renta variable. Análisis fundamental. Teoría de la elección de cartera. El modelo de valoración de activos de capital (CAPM). La teoría de valoración de activos por arbitraje (APT). Análisis técnico.","Microeconomía","Economía financiera y corporativa"]
[null,3,"B",24,"3.B.24","Análisis de los instrumentos financieros de renta fija. Determinación del precio y rendimiento de los bonos. La estructura temporal de los tipos de interés. Valoración del riesgo y del rendimiento de los bonos: duración y convexidad.","Microeconomía","Economía financiera y corporativa"]
[null,3,"B",25,"3.B.25","Análisis de los instrumentos y de los mercados de derivados.","Microeconomía","Economía financiera y corporativa"]
[null,3,"B",26,"3.B.26","Crisis financieras y pánicos bancarios; especial referencia a la crisis financiera internacional iniciada en 2007-2008. Gestión de riesgos de las instituciones financieras.","Microeconomía","Economía financiera y corporativa"]
[null,3,"B",27,"3.B.27","Regulación financiera bancaria y no-bancaria. Fundamentos teóricos y evidencia empírica.","Microeconomía","Economía financiera y corporativa"]
[null,3,"B",28,"3.B.28","Economía de los países en desarrollo. Teorías recientes del desarrollo económico. Evidencia empírica, con especial referencia a la aproximación experimental, e implicaciones para el diseño de políticas.","Macroeconomía","Crecimiento económico"]
[null,3,"B",29,"3.B.29","La financiación exterior del desarrollo económico. El problema de la deuda externa. La ayuda al desarrollo.","Macroeconomía","Economía abierta"]
[null,3,"B",30,"3.B.30","El Grupo del Banco Mundial, los Bancos Regionales de Desarrollo y otras instituciones multilaterales de desarrollo.","Mixto","Organismos internacionales"]
[null,3,"B",31,"3.B.31","El cambio climático y su impacto en la economía. Evidencia y modelos integrados de evaluación. Acuerdos internacionales y principales medidas adoptadas para hacer frente al cambio climático.","Macroeconomía","Crecimiento económico"]
[null,3,"B",32,"3.B.32","Perspectivas económicas mundiales. Estructura sectorial y geográfica de los flujos comerciales y financieros internacionales. Las nuevas áreas emergentes.","Mixto","Historia económica"]
[null,3,"B",33,"3.B.33","La OMC. Antecedentes y Organización actual. El GATT y los Acuerdos sobre el comercio de mercancías. Situación actual.","Mixto","Organismos internacionales"]
[null,3,"B",34,"3.B.34","La OMC. Los acuerdos distintos de los de mercancías.","Mixto","Organismos internacionales"]
[null,3,"B",35,"3.B.35","Procesos de integración no comunitarios.","Mixto","Organismos internacionales"]
[null,3,"B",36,"3.B.36","Tratados, orden jurídico e instituciones de la Unión Europea.","Mixto","Unión Europea"]
[null,3,"B",37,"3.B.37","Las finanzas de la Unión Europea y el presupuesto comunitario. El marco financiero plurianual actual.","Mixto","Unión Europea"]
[null,3,"B",38,"3.B.38","La política agrícola de la Unión Europea. Problemas económicos y procesos de reforma. La política pesquera común.","Mixto","Unión Europea"]
[null,3,"B",39,"3.B.39","El mercado único de la Unión Europea. El principio de libre circulación de mercancías, servicios, personas y capitales. La política de competencia.","Mixto","Unión Europea"]
[null,3,"B",40,"3.B.40","La Cohesión Económica y Social en la Unión Europea: política regional e instrumentos presupuestarios y financieros. Política social y de empleo. El proceso de convergencia real en la Unión Europea.","Mixto","Unión Europea"]
[null,3,"B",41,"3.B.41","La política comercial de la Unión Europea.","Mixto","Unión Europea"]
[null,3,"B",42,"3.B.42","Las relaciones económicas exteriores de la Unión Europea. La política de cooperación al desarrollo de la Unión Europea.","Mixto","Unión Europea"]
[null,3,"B",43,"3.B.43","El origen del euro: funcionamiento y evolución del Sistema Monetario Europeo. Los criterios de convergencia nominal. El Sistema Europeo de Bancos Centrales: objetivos e instrumentos. La política monetaria en la Eurozona desde 2009.","Mixto","Unión Europea"]
[null,3,"B",44,"3.B.44","La Unión Bancaria: Pilares y Código normativo único. La Unión de Mercados de Capitales.","Mixto","Unión Europea"]
[null,3,"B",45,"3.B.45","La gobernanza económica de la Unión Europea y de la zona euro. El Semestre Europeo. Las reglas fiscales y el Procedimiento de Desequilibrios Macroeconómicos. El Mecanismo Europeo de Estabilidad. La respuesta común de la política fiscal a partir de la covid-19.","Mixto","Unión Europea"]
[null,4,"A",1,"4.A.1","Fuentes estadísticas españolas. Metodologías y limitaciones.","Economía española","Fuentes estadísticas"]
[null,4,"A",2,"4.A.2","Los recursos humanos en España: estructura demográfica y capital humano. Proyecciones de población a medio y largo plazo: implicaciones para el crecimiento económico.","Economía española","Mercado de trabajo"]
[null,4,"A",3,"4.A.3","La distribución personal y entre factores productivos de la renta en España. La desigualdad de la renta, la riqueza y el consumo. El efecto redistributivo del sector público español.","Economía española","Desigualdad"]
[null,4,"A",4,"4.A.4","Los sectores agrario y pesquero en España.","Economía española","Sector primario"]
[null,4,"A",5,"4.A.5","Estructura del sector energético y sus subsectores: sistema eléctrico, sistema gasista y productos petrolíferos. Nuevas tecnologías y retos del sector.","Economía española","Sector extractivo y energía"]
[null,4,"A",6,"4.A.6","La política española de energía y clima: mitigación y adaptación al cambio climático. Vinculación con la política de energía y clima de la UE. Políticas sectoriales de medioambiente.","Economía española","Política medioambiental"]
[null,4,"A",7,{"$f":"_xlfn.CONCAT(B99,\".\",C99,\".\",D99)","v":"4.A.7"},"El sistema y la política de ciencia y tecnología en España. Vinculación con la política de I+D de la Unión Europea. La actividad de investigación, desarrollo e innovación (I+D+i) en los sectores público y privado. Comparación con buenas prácticas internacionales.","Economía española","Política de ciencia y tecnología"]
[null,4,"A",8,"4.A.8","La empresa en España. Características principales: productividad, internacionalización, tamaño y financiación. Comparación entre la empresa industrial y la empresa de servicios. El clima de negocio en España. El sector público empresarial.","Economía española","Empresa"]
[null,4,"A",9,"4.A.9","Análisis de la industria en España. Características y situación actual. Los retos de la industria y la política industrial en España en el contexto de las economías desarrolladas. La estrategia de la UE.","Economía española","Industria y política industrial"]
[null,4,"A",10,"4.A.10","Estructura sectorial de la industria en España. Clasificación de sectores según nivel de contenido tecnológico y de demanda. Análisis de los principales sectores: industria agroalimentaria, industria automovilística, industria química y farmacéutica, e industria de fabricación de bienes de equipo y de alta tecnología.","Economía española","Industria y política industrial"]
[null,4,"A",11,"4.A.11","El sector de la construcción en España. El mercado de la vivienda. Problemas y política de vivienda y suelo.","Economía española","Construcción"]
[null,4,"A",12,"4.A.12","Estructura y política del sector de los transportes y telecomunicaciones en España.","Economía española","Servicios"]
[null,4,"A",13,"4.A.13","El turismo en España: evolución, retos y política turística.","Economía española","Servicios"]
[null,4,"A",14,"4.A.14","Estructura, políticas y retos de la distribución comercial, con especial referencia al comercio electrónico.","Economía española","Servicios"]
[null,4,"A",15,"4.A.15","La defensa y la promoción de la competencia en España. Principios de regulación económica eficiente. Garantía de unidad de mercado.","Economía española","Políticas de liberalización"]
[null,4,"A",16,"4.A.16","Mercado de trabajo en España. Características, funcionamiento y problemas. Las políticas de empleo.","Economía española","Mercado de trabajo"]
[null,4,"A",17,"4.A.17","Economía de las regiones españolas: especialización regional, convergencia real y política de desarrollo regional.","Economía española","Política regional"]
[null,4,"A",18,"4.A.18","El sistema financiero español (I).  Evolución reciente del sistema financiero. Génesis y desarrollo de la crisis del sistema financiero español iniciada en 2008. La reestructuración de las entidades de crédito. El Programa de Asistencia Financiera.","Economía española","Sector financiero y política monetaria"]
[null,4,"A",19,"4.A.19","El sistema financiero español (II). Las entidades de crédito en España: Configuración actual del sector bancario español y principales indicadores. El marco de regulación, supervisión y gestión de crisis.","Economía española","Sector financiero y política monetaria"]
[null,4,"A",20,"4.A.20","El sistema financiero español (III). Mercados de valores y otras formas de financiación no bancaria, agentes e instrumentos. Innovación financiera.","Economía española","Sector financiero y política monetaria"]
[null,4,"A",21,"4.A.21","Análisis de la evolución de la balanza de pagos y de la Posición de Inversión Internacional de España desde la adopción del euro. Posición neta del Banco de España frente al Eurosistema. La sostenibilidad externa.","Economía española","Sector exterior"]
[null,4,"A",22,"4.A.22","La internacionalización de la economía española (I). Estructura sectorial y geográfica de la balanza de bienes y de servicios en España en la actualidad. Indicadores de competitividad. La integración de España en las cadenas globales de valor.","Economía española","Sector exterior"]
[null,4,"A",23,"4.A.23","La internacionalización de la economía española (II). Estructura sectorial y geográfica de la inversión extranjera en España y de la inversión española en el exterior en la actualidad.","Economía española","Sector exterior"]
[null,4,"A",24,"4.A.24","La política española de internacionalización (I). Instrumentos financieros de ayuda a la exportación y a la inversión exterior. Evaluación y comparación con buenas prácticas internacionales.","Economía española","Sector exterior"]
[null,4,"A",25,"4.A.25","La política española de internacionalización (II). La promoción comercial. Organismos e instrumentos. Evaluación y comparación con buenas prácticas internacionales.","Economía española","Sector exterior"]
[null,4,"A",26,"4.A.26","La política de cooperación al desarrollo en España. Instrumentos de cooperación técnica y financiera. Evaluación del diseño de la política y análisis de impacto económico.","Economía española","Sector exterior"]
[null,4,"A",27,"4.A.27","La economía española en el período 1959-1999. El Plan de Estabilización de 1959. La economía española en la década de 1960. Las crisis energéticas de los años 70. La adhesión a las Comunidades Europeas. El proceso de ajuste macroeconómico para la entrada en la zona euro.","Economía española","Historia económica"]
[null,4,"A",28,"4.A.28","Evolución de la economía y de la política económica en España desde la constitución de la zona euro hasta 2019. Especial referencia a la crisis económica y financiera iniciada en 2008.","Economía española","Historia económica"]
[null,4,"A",29,"4.A.29","Evolución de la economía y de la política económica española desde la crisis de la Covid-19. Situación actual de la economía española y perspectivas. Los desequilibrios macroeconómicos de España, según el Procedimiento de Desequilibrios Macroeconómicos de la UE.","Economía española","Historia económica"]
[null,4,"A",30,"4.A.30","Las relaciones financieras de España con la Unión Europea: flujos presupuestarios y extra-presupuestarios, y saldo financiero España-Unión Europea. Evolución reciente y situación actual. España en el Marco Financiero Plurianual 2021-2027. La convergencia real de España con la Unión Europea.","Economía española","Historia económica"]
[null,4,"B",1,"4.B.1","El sector público: delimitación, operaciones y cuentas principales según el Sistema Europeo de Cuentas.","Economía del sector público","Contabilidad pública y fuentes estadísticas"]
[null,4,"B",2,"4.B.2","Los mecanismos de decisión del sector público. Reglas de votación. La democracia representativa. La producción pública y la burocracia. Justificación de la existencia de límites normativos a la actividad del sector público.","Economía del sector público","Economía política"]
[null,4,"B",3,"4.B.3","El presupuesto como elemento de redistribución. El Estado de Bienestar: instrumentos, problemas y reformas. Medición e indicadores del impacto redistributivo.","Economía del sector público","Gastos y presupuestos"]
[null,4,"B",4,"4.B.4","El presupuesto como elemento compensador de la actividad económica. Componentes discrecionales y automáticos del presupuesto: saldo cíclico, saldo estructural y esfuerzo fiscal.","Economía del sector público","Política fiscal y estabilización"]
[null,4,"B",5,"4.B.5","El gasto público. Razones de su crecimiento. El debate sobre el tamaño del sector público, en lo referente al gasto. Comparaciones internacionales.","Economía del sector público","Gastos y presupuestos"]
[null,4,"B",6,"4.B.6","Evaluación de las políticas públicas. Técnicas de evaluación de impacto. Análisis coste-beneficio, análisis coste-eficacia y otras técnicas de evaluación.","Economía del sector público","Inversión pública"]
[null,4,"B",7,"4.B.7","Ingresos públicos. Elementos definidores y clases de impuestos. Principios impositivos.","Economía del sector público","Impuestos"]
[null,4,"B",8,"4.B.8","Traslación e incidencia de los impuestos en mercados competitivos y monopolistas. Enfoques de equilibrio parcial y general.","Economía del sector público","Impuestos"]
[null,4,"B",9,{"$f":"_xlfn.CONCAT(B131,\".\",C131,\".\",D131)","v":"4.B.9"},"Efecto renta y efecto sustitución de los impuestos. Concepto y medición del exceso de gravamen. Medidas de progresividad impositiva.","Economía del sector público","Impuestos"]
[null,4,"B",10,"4.B.10","Imposición y oferta. Efectos incentivo de los impuestos.","Economía del sector público","Impuestos"]
[null,4,"B",11,"4.B.11","La imposición óptima. Tipo impositivo óptimo. Regla de Ramsey. El compromiso entre eficiencia y equidad de la política tributaria.","Economía del sector público","Impuestos"]
[null,4,"B",12,"4.B.12","La imposición directa: teoría y comparaciones internacionales.","Economía del sector público","Impuestos"]
[null,4,"B",13,"4.B.13","La imposición indirecta: teoría y comparaciones internacionales.","Economía del sector público","Impuestos"]
[null,4,"B",14,"4.B.14","La teoría del federalismo fiscal: la asignación óptima de las funciones entre los distintos niveles de gobierno para alcanzar el bienestar máximo. La financiación de las haciendas territoriales: impuestos, transferencias y deuda.","Economía del sector público","Federalismo fiscal y haciendas territoriales"]
[null,4,"B",15,"4.B.15","La empresa pública. Razones de su existencia. La política de privatizaciones. Comparaciones internacionales.","Economía del sector público","Empresas públicas"]
[null,4,"B",16,"4.B.16","El impuesto sobre la renta de las personas físicas en España.","Economía del sector público","Impuestos"]
[null,4,"B",17,"4.B.17","El impuesto sobre sociedades en España.","Economía del sector público","Impuestos"]
[null,4,"B",18,"4.B.18","Fiscalidad internacional. El Impuesto sobre la Renta de no Residentes en España. Convenios de doble imposición, con especial referencia al modelo de la OCDE. El problema de la erosión de bases imponibles y propuestas de solución.","Economía del sector público","Impuestos"]
[null,4,"B",19,"4.B.19","La imposición patrimonial en España: el impuesto sobre el patrimonio, el impuesto sobre sucesiones y donaciones, el impuesto sobre transmisiones patrimoniales y actos jurídicos documentados, y el impuesto sobre bienes inmuebles.","Economía del sector público","Impuestos"]
[null,4,"B",20,"4.B.20","La imposición indirecta en España: el IVA y los impuestos especiales.","Economía del sector público","Impuestos"]
[null,4,"B",21,"4.B.21","Marco legal e institucional de los presupuestos en España. Principios presupuestarios, con especial referencia a la estabilidad y la sostenibilidad. Los Presupuestos Generales del Estado: elaboración, aprobación, ejecución y control. Clasificaciones de ingresos y gastos. Modificaciones presupuestarias.","Economía del sector público","Gastos y presupuestos"]
[null,4,"B",22,"4.B.22","Las grandes cifras de los Presupuestos Generales del Estado (PGE). Clasificación económica, orgánica y por políticas de gasto. Visión consolidada de los PGE.","Economía del sector público","Gastos y presupuestos"]
[null,4,"B",23,"4.B.23","Las finanzas de las Administraciones Públicas en España en términos de contabilidad nacional. Situación actual y perspectivas según el Programa de Estabilidad. Estructura de ingresos y presión fiscal. Gasto por funciones según la clasificación COFOG. Distribución de gastos e ingresos públicos por subsectores de las Administraciones Públicas.","Economía del sector público","Gastos y presupuestos"]
[null,4,"B",24,"4.B.24","El Sistema de la Seguridad Social en España. Prestaciones y su financiación. La sostenibilidad del sistema público de pensiones.","Economía del sector público","Gastos y presupuestos"]
[null,4,"B",25,"4.B.25","Las Administraciones Territoriales en España. Competencias y sistemas de financiación. El endeudamiento de las Administraciones Territoriales.","Economía del sector público","Federalismo fiscal y haciendas territoriales"]
[null,4,"B",26,"4.B.26","El saldo presupuestario y la deuda de las Administraciones Públicas en España: análisis de su evolución reciente y comparación internacional. Política de financiación del Tesoro en la actualidad.","Economía del sector público","Gastos y presupuestos"]
[null,5,"A",1,"5.A.1","Los regímenes de comercio exterior.","Marketing internacional y técnicas comerciales"]
[null,5,"A",2,"5.A.2","Los instrumentos de defensa comercial.","Marketing internacional y técnicas comerciales"]
[null,5,"A",3,"5.A.3","Los instrumentos de atracción de inversiones exteriores.","Marketing internacional y técnicas comerciales"]
[null,5,"A",4,"5.A.4","Los instrumentos de promoción del turismo en España.","Marketing internacional y técnicas comerciales"]
[null,5,"A",5,"5.A.5","La regulación de las inversiones extranjeras en España y de las españolas en el exterior.","Marketing internacional y técnicas comerciales"]
[null,5,"A",6,"5.A.6","Formas de penetración e implantación en los mercados. El estudio de los mercados exteriores y la prospección.","Marketing internacional y técnicas comerciales"]
[null,5,"A",7,"5.A.7","Los canales de distribución y las redes de venta.","Marketing internacional y técnicas comerciales"]
[null,5,"A",8,"5.A.8","La oferta internacional: el producto y el precio. La comunicación en el comercio internacional.","Marketing internacional y técnicas comerciales"]
[null,5,"A",9,"5.A.9","El cuadro jurídico de las operaciones de comercio exterior: el contrato de venta internacional y la resolución de litigios.","Marketing internacional y técnicas comerciales"]
[null,5,"A",10,"5.A.10","Las políticas logísticas y financieras de la empresa exportadora. Los medios de pago en el comercio internacional.","Marketing internacional y técnicas comerciales"]
[null,5,"B",1,"5.B.1","Supuestos clásicos del modelo de regresión lineal. Aproximación lineal al modelo no lineal. Método de mínimos cuadrados ordinarios y método de máxima verosimilitud. Medidas de bondad de ajuste del modelo.","Econometría"]
[null,5,"B",2,"5.B.2","Propiedades de los estimadores de mínimos cuadrados ordinarios para muestras finitas y muestras grandes en el modelo de regresión lineal. Contraste de hipótesis e intervalos de confianza.","Econometría"]
[null,5,"B",3,{"$f":"_xlfn.CONCAT(B161,\".\",C161,\".\",D161)","v":"5.B.3"},"Heterocedasticidad y autocorrelación: origen, consecuencias, detección y soluciones. Estimación por mínimos cuadrados generalizados.","Econometría"]
[null,5,"B",4,"5.B.4","La causalidad en los modelos de regresión. Problema de la variable omitida y estimación por variables instrumentales. Otras soluciones: diseños experimentales, regresión en discontinuidad y diferencias en diferencias.","Econometría"]
[null,5,"B",5,"5.B.5","Procesos estocásticos. Ruido blanco, AR, MA, ARMA y ARIMA: identificación, estimación, verificación y predicción.","Econometría"]
[null,5,"B",6,"5.B.6","Datos de panel. Descripción del problema. El modelo de efectos fijos y de efectos aleatorios. Estimación.","Econometría"]
[null,5,"C",1,"5.C.1","Las fuentes del Derecho Administrativo. La Constitución. La ley. Los decretos-leyes. La delegación legislativa.","Derecho administrativo y organización del Estado"]
[null,5,"C",2,"5.C.2","El reglamento. La potestad reglamentaria. Los reglamentos ilegales. Actos administrativos generales, circulares e instrucciones.","Derecho administrativo y organización del Estado"]
[null,5,"C",3,"5.C.3","El acto administrativo: concepto, clases y elementos. Su motivación y notificación. Eficacia y validez de los actos administrativos. Revisión, anulación y revocación.","Derecho administrativo y organización del Estado"]
[null,5,"C",4,"5.C.4","Los recursos administrativos.","Derecho administrativo y organización del Estado"]
[null,5,"C",5,"5.C.5","La jurisdicción contencioso-administrativa. Extensión y límites. Las partes del procedimiento. La sentencia. Recursos.","Derecho administrativo y organización del Estado"]
[null,5,"C",6,"5.C.6","Los contratos del sector público: concepto y clases. Estudio de sus elementos. Su cumplimiento. La revisión de precios y otras alteraciones contractuales. Incumplimiento de los contratos.","Derecho administrativo y organización del Estado"]
[null,5,"C",7,"5.C.7","El servicio público: concepto y clases. Forma de gestión de los servicios públicos. Examen especial de la gestión directa. La gestión indirecta: modalidades. La concesión. Régimen jurídico.","Derecho administrativo y organización del Estado"]
[null,5,"C",8,"5.C.8","Procedimiento administrativo común de las administraciones públicas: objeto y ámbito de aplicación. El procedimiento administrativo: concepto y naturaleza. Las garantías del procedimiento. Iniciación, ordenación, instrucción y terminación del procedimiento administrativo común. Los procedimientos especiales.","Derecho administrativo y organización del Estado"]
[null,5,"C",9,"5.C.9","Régimen jurídico del personal al servicio de las administraciones públicas. Ley del Estatuto Básico del Empleado Público. La Ley de Medidas para la Reforma de la Función Pública. Órganos superiores de la Función Pública. Oferta de empleo público.","Derecho administrativo y organización del Estado"]
[null,5,"C",10,"5.C.10","La Constitución española de 1978: estructura y contenido. Derechos y deberes fundamentales. Su garantía y suspensión. El Defensor del Pueblo. El Tribunal de Cuentas. El Tribunal Constitucional. Reforma de la Constitución.","Derecho administrativo y organización del Estado"]
[null,5,"C",11,"5.C.11","El Gobierno, su Presidente y el Consejo de Ministros. La Ley de Régimen Jurídico del Sector Público. Objeto y ámbito de aplicación. Principios generales. Organización y funcionamiento de la Administración General del Estado. Organización Central. Órganos Superiores y Directivos. Los Ministerios y su estructura interna. La Organización territorial de la Administración General del Estado. Las Delegaciones y Subdelegaciones del Gobierno.","Derecho administrativo y organización del Estado"]
[null,5,"C",12,"5.C.12","Organización y competencias del Ministerio de Asuntos Económicos y Transformación Digital, y del Ministerio de Industria, Comercio y Turismo. Especial mención a la Secretaría de Estado de Economía y Apoyo a la Empresa, y a la Secretaría de Estado de Comercio. Otros Ministerios económicos. La Administración Territorial del Ministerio de Industria, Comercio y Turismo. Su administración institucional. ICEX España Exportación e Inversiones.","Derecho administrativo y organización del Estado"]
[null,5,"C",13,"5.C.13","Organización territorial del Estado. Las Comunidades Autónomas: constitución, competencias, Estatutos de autonomía. El sistema institucional de las Comunidades Autónomas. La Administración Local.","Derecho administrativo y organización del Estado"]
[null,5,"C",14,"5.C.14","Políticas de igualdad de género. La Ley Orgánica 3/2007, de 22 de marzo, para la igualdad efectiva de mujeres y hombres. Políticas contra la violencia de género. La Ley Orgánica 1/2004, de 28 de diciembre, de Medidas de Protección Integral contra la Violencia de Género. Políticas dirigidas a la atención de personas discapacitadas y/o dependientes: la Ley 39/2006, de 14 de diciembre, de Promoción de la Autonomía Personal y atención a las personas en situación de dependencia.","Derecho administrativo y organización del Estado"]
[null,5,"C",15,"5.C.15","La gobernanza pública y el gobierno abierto. Concepto y principios informadores del gobierno abierto: colaboración, participación, transparencia y rendición de cuentas. Datos abiertos y reutilización. El marco jurídico y los planes de gobierno abierto en España.","Derecho administrativo y organización del Estado"]

{"sheet":"Tabla dinámica temas","index":11,"n_rows":29,"n_cols":3,"rows_kept":29,"cut":false,"hidden":false,"merged":[]}
[]
[null,"Ejercicio",3]
[]
[null,"Etiquetas de fila","Cuenta de Nombre del tema"]
[null,"A",45]
[null,"Mixto",7]
[null,"Pensamiento económico",7]
[null,"Microeconomía",17]
[null,"Economía del Bienestar e Intervención del Sector Público",3]
[null,"Información y poder de mercado",8]
[null,"Modelo neoclásico básico",6]
[null,"Macroeconomía",21]
[null,"Ciclo económico y políticas de demanda",8]
[null,"Contabilidad Nacional",2]
[null,"Crecimiento económico",4]
[null,"Demanda Agregada y Oferta Agregada",7]
[null,"B",45]
[null,"Mixto",18]
[null,"Historia económica",3]
[null,"Organismos internacionales",5]
[null,"Unión Europea",10]
[null,"Microeconomía",16]
[null,"Comercio Internacional",6]
[null,"Economía financiera y corporativa",10]
[null,"Macroeconomía",11]
[null,"Contabilidad Nacional",1]
[null,"Crecimiento económico",2]
[null,"Economía abierta",8]
[null,"Total general",90]

{"sheet":"Organización del estudio","index":12,"n_rows":1,"n_cols":2,"rows_kept":1,"cut":false,"hidden":false,"merged":[[0,1,3,8]]}
[null,"Organización del estudio"]

{"sheet":"Cronograma","index":13,"n_rows":179,"n_cols":9,"rows_kept":179,"cut":false,"hidden":false,"merged":[]}
[null,null,"Semana","Día (opc.)","Tema","Nombre del tema","Categoría","Bloque","Comentario"]
[null,null,1,"Lunes","3.A.8",{"$f":"IFERROR(VLOOKUP('Cronograma'!$E2,ListadoDeTemas1[[Tema]:[Bloque]],COLUMNS('Cronograma'!$E2:F2),FALSE),\"\")","v":"Teoría de la demanda del consumidor (I). Axiomas sobre las preferencias, función de utilidad y función de demanda marshalliana. La teoría de la preferencia revelada. Precios hedónicos."},{"$f":"IFERROR(VLOOKUP('Cronograma'!$E2,ListadoDeTemas1[[Tema]:[Bloque]],COLUMNS('Cronograma'!$E2:G2),FALSE),\"\")","v":"Microeconomía"},{"$f":"IFERROR(VLOOKUP('Cronograma'!$E2,ListadoDeTemas1[[Tema]:[Bloque]],COLUMNS('Cronograma'!$E2:H2),FALSE),\"\")","v":"Modelo neoclásico básico"}]
[null,null,null,null,"3.A.10",{"$f":"IFERROR(VLOOKUP('Cronograma'!$E3,ListadoDeTemas1[[Tema]:[Bloque]],COLUMNS('Cronograma'!$E3:F3),FALSE),\"\")","v":"Teoría de la demanda del consumidor (III). Elección del consumidor en situaciones de riesgo e incertidumbre."},{"$f":"IFERROR(VLOOKUP('Cronograma'!$E3,ListadoDeTemas1[[Tema]:[Bloque]],COLUMNS('Cronograma'!$E3:G3),FALSE),\"\")","v":"Microeconomía"},{"$f":"IFERROR(VLOOKUP('Cronograma'!$E3,ListadoDeTemas1[[Tema]:[Bloque]],COLUMNS('Cronograma'!$E3:H3),FALSE),\"\")","v":"Información y poder de mercado"}]
[null,null,null,null,null,{"$f":"IFERROR(VLOOKUP('Cronograma'!$E4,ListadoDeTemas1[[Tema]:[Bloque]],COLUMNS('Cronograma'!$E4:F4),FALSE),\"\")","v":""},{"$f":"IFERROR(VLOOKUP('Cronograma'!$E4,ListadoDeTemas1[[Tema]:[Bloque]],COLUMNS('Cronograma'!$E4:G4),FALSE),\"\")","v":""},{"$f":"IFERROR(VLOOKUP('Cronograma'!$E4,ListadoDeTemas1[[Tema]:[Bloque]],COLUMNS('Cronograma'!$E4:H4),FALSE),\"\")","v":""}]
[null,null,null,null,null,{"$f":"IFERROR(VLOOKUP('Cronograma'!$E5,ListadoDeTemas1[[Tema]:[Bloque]],COLUMNS('Cronograma'!$E5:F5),FALSE),\"\")","v":""},{"$f":"IFERROR(VLOOKUP('Cronograma'!$E5,ListadoDeTemas1[[Tema]:[Bloque]],COLUMNS('Cronograma'!$E5:G5),FALSE),\"\")","v":""},{"$f":"IFERROR(VLOOKUP('Cronograma'!$E5,ListadoDeTemas1[[Tema]:[Bloque]],COLUMNS('Cronograma'!$E5:H5),FALSE),\"\")","v":""}]
[null,null,null,null,null,{"$f":"IFERROR(VLOOKUP('Cronograma'!$E6,ListadoDeTemas1[[Tema]:[Bloque]],COLUMNS('Cronograma'!$E6:F6),FALSE),\"\")","v":""},{"$f":"IFERROR(VLOOKUP('Cronograma'!$E6,ListadoDeTemas1[[Tema]:[Bloque]],COLUMNS('Cronograma'!$E6:G6),FALSE),\"\")","v":""},{"$f":"IFERROR(VLOOKUP('Cronograma'!$E6,ListadoDeTemas1[[Tema]:[Bloque]],COLUMNS('Cronograma'!$E6:H6),FALSE),\"\")","v":""}]
[null,null,null,null,null,{"$f":"IFERROR(VLOOKUP('Cronograma'!$E7,ListadoDeTemas1[[Tema]:[Bloque]],COLUMNS('Cronograma'!$E7:F7),FALSE),\"\")","v":""},{"$f":"IFERROR(VLOOKUP('Cronograma'!$E7,ListadoDeTemas1[[Tema]:[Bloque]],COLUMNS('Cronograma'!$E7:G7),FALSE),\"\")","v":""},{"$f":"IFERROR(VLOOKUP('Cronograma'!$E7,ListadoDeTemas1[[Tema]:[Bloque]],COLUMNS('Cronograma'!$E7:H7),FALSE),\"\")","v":""}]
[null,null,null,null,null,{"$f":"IFERROR(VLOOKUP('Cronograma'!$E8,ListadoDeTemas1[[Tema]:[Bloque]],COLUMNS('Cronograma'!$E8:F8),FALSE),\"\")","v":""},{"$f":"IFERROR(VLOOKUP('Cronograma'!$E8,ListadoDeTemas1[[Tema]:[Bloque]],COLUMNS('Cronograma'!$E8:G8),FALSE),\"\")","v":""},{"$f":"IFERROR(VLOOKUP('Cronograma'!$E8,ListadoDeTemas1[[Tema]:[Bloque]],COLUMNS('Cronograma'!$E8:H8),FALSE),\"\")","v":""}]
[null,null,null,null,null,{"$f":"IFERROR(VLOOKUP('Cronograma'!$E9,ListadoDeTemas1[[Tema]:[Bloque]],COLUMNS('Cronograma'!$E9:F9),FALSE),\"\")","v":""},{"$f":"IFERROR(VLOOKUP('Cronograma'!$E9,ListadoDeTemas1[[Tema]:[Bloque]],COLUMNS('Cronograma'!$E9:G9),FALSE),\"\")","v":""},{"$f":"IFERROR(VLOOKUP('Cronograma'!$E9,ListadoDeTemas1[[Tema]:[Bloque]],COLUMNS('Cronograma'!$E9:H9),FALSE),\"\")","v":""}]
[null,null,null,null,null,{"$f":"IFERROR(VLOOKUP('Cronograma'!$E10,ListadoDeTemas1[[Tema]:[Bloque]],COLUMNS('Cronograma'!$E10:F10),FALSE),\"\")","v":""},{"$f":"IFERROR(VLOOKUP('Cronograma'!$E10,ListadoDeTemas1[[Tema]:[Bloque]],COLUMNS('Cronograma'!$E10:G10),FALSE),\"\")","v":""},{"$f":"IFERROR(VLOOKUP('Cronograma'!$E10,ListadoDeTemas1[[Tema]:[Bloque]],COLUMNS('Cronograma'!$E10:H10),FALSE),\"\")","v":""}]
[null,null,null,null,null,{"$f":"IFERROR(VLOOKUP('Cronograma'!$E11,ListadoDeTemas1[[Tema]:[Bloque]],COLUMNS('Cronograma'!$E11:F11),FALSE),\"\")","v":""},{"$f":"IFERROR(VLOOKUP('Cronograma'!$E11,ListadoDeTemas1[[Tema]:[Bloque]],COLUMNS('Cronograma'!$E11:G11),FALSE),\"\")","v":""},{"$f":"IFERROR(VLOOKUP('Cronograma'!$E11,ListadoDeTemas1[[Tema]:[Bloque]],COLUMNS('Cronograma'!$E11:H11),FALSE),\"\")","v":""}]
[null,null,null,null,null,{"$f":"IFERROR(VLOOKUP('Cronograma'!$E12,ListadoDeTemas1[[Tema]:[Bloque]],COLUMNS('Cronograma'!$E12:F12),FALSE),\"\")","v":""},{"$f":"IFERROR(VLOOKUP('Cronograma'!$E12,ListadoDeTemas1[[Tema]:[Bloque]],COLUMNS('Cronograma'!$E12:G12),FALSE),\"\")","v":""},{"$f":"IFERROR(VLOOKUP('Cronograma'!$E12,ListadoDeTemas1[[Tema]:[Bloque]],COLUMNS('Cronograma'!$E12:H12),FALSE),\"\")","v":""}]
[null,null,null,null,null,{"$f":"IFERROR(VLOOKUP('Cronograma'!$E13,ListadoDeTemas1[[Tema]:[Bloque]],COLUMNS('Cronograma'!$E13:F13),FALSE),\"\")","v":""},{"$f":"IFERROR(VLOOKUP('Cronograma'!$E13,ListadoDeTemas1[[Tema]:[Bloque]],COLUMNS('Cronograma'!$E13:G13),FALSE),\"\")","v":""},{"$f":"IFERROR(VLOOKUP('Cronograma'!$E13,ListadoDeTemas1[[Tema]:[Bloque]],COLUMNS('Cronograma'!$E13:H13),FALSE),\"\")","v":""}]
[null,null,null,null,null,{"$f":"IFERROR(VLOOKUP('Cronograma'!$E14,ListadoDeTemas1[[Tema]:[Bloque]],COLUMNS('Cronograma'!$E14:F14),FALSE),\"\")","v":""},{"$f":"IFERROR(VLOOKUP('Cronograma'!$E14,ListadoDeTemas1[[Tema]:[Bloque]],COLUMNS('Cronograma'!$E14:G14),FALSE),\"\")","v":""},{"$f":"IFERROR(VLOOKUP('Cronograma'!$E14,ListadoDeTemas1[[Tema]:[Bloque]],COLUMNS('Cronograma'!$E14:H14),FALSE),\"\")","v":""}]
[null,null,null,null,null,{"$f":"IFERROR(VLOOKUP('Cronograma'!$E15,ListadoDeTemas1[[Tema]:[Bloque]],COLUMNS('Cronograma'!$E15:F15),FALSE),\"\")","v":""},{"$f":"IFERROR(VLOOKUP('Cronograma'!$E15,ListadoDeTemas1[[Tema]:[Bloque]],COLUMNS('Cronograma'!$E15:G15),FALSE),\"\")","v":""},{"$f":"IFERROR(VLOOKUP('Cronograma'!$E15,ListadoDeTemas1[[Tema]:[Bloque]],COLUMNS('Cronograma'!$E15:H15),FALSE),\"\")","v":""}]
[null,null,null,null,null,{"$f":"IFERROR(VLOOKUP('Cronograma'!$E16,ListadoDeTemas1[[Tema]:[Bloque]],COLUMNS('Cronograma'!$E16:F16),FALSE),\"\")","v":""},{"$f":"IFERROR(VLOOKUP('Cronograma'!$E16,ListadoDeTemas1[[Tema]:[Bloque]],COLUMNS('Cronograma'!$E16:G16),FALSE),\"\")","v":""},{"$f":"IFERROR(VLOOKUP('Cronograma'!$E16,ListadoDeTemas1[[Tema]:[Bloque]],COLUMNS('Cronograma'!$E16:H16),FALSE),\"\")","v":""}]
[null,null,null,null,null,{"$f":"IFERROR(VLOOKUP('Cronograma'!$E17,ListadoDeTemas1[[Tema]:[Bloque]],COLUMNS('Cronograma'!$E17:F17),FALSE),\"\")","v":""},{"$f":"IFERROR(VLOOKUP('Cronograma'!$E17,ListadoDeTemas1[[Tema]:[Bloque]],COLUMNS('Cronograma'!$E17:G17),FALSE),\"\")","v":""},{"$f":"IFERROR(VLOOKUP('Cronograma'!$E17,ListadoDeTemas1[[Tema]:[Bloque]],COLUMNS('Cronograma'!$E17:H17),FALSE),\"\")","v":""}]
[null,null,null,null,null,{"$f":"IFERROR(VLOOKUP('Cronograma'!$E18,ListadoDeTemas1[[Tema]:[Bloque]],COLUMNS('Cronograma'!$E18:F18),FALSE),\"\")","v":""},{"$f":"IFERROR(VLOOKUP('Cronograma'!$E18,ListadoDeTemas1[[Tema]:[Bloque]],COLUMNS('Cronograma'!$E18:G18),FALSE),\"\")","v":""},{"$f":"IFERROR(VLOOKUP('Cronograma'!$E18,ListadoDeTemas1[[Tema]:[Bloque]],COLUMNS('Cronograma'!$E18:H18),FALSE),\"\")","v":""}]
[null,null,null,null,null,{"$f":"IFERROR(VLOOKUP('Cronograma'!$E19,ListadoDeTemas1[[Tema]:[Bloque]],COLUMNS('Cronograma'!$E19:F19),FALSE),\"\")","v":""},{"$f":"IFERROR(VLOOKUP('Cronograma'!$E19,ListadoDeTemas1[[Tema]:[Bloque]],COLUMNS('Cronograma'!$E19:G19),FALSE),\"\")","v":""},{"$f":"IFERROR(VLOOKUP('Cronograma'!$E19,ListadoDeTemas1[[Tema]:[Bloque]],COLUMNS('Cronograma'!$E19:H19),FALSE),\"\")","v":""}]
[null,null,null,null,null,{"$f":"IFERROR(VLOOKUP('Cronograma'!$E20,ListadoDeTemas1[[Tema]:[Bloque]],COLUMNS('Cronograma'!$E20:F20),FALSE),\"\")","v":""},{"$f":"IFERROR(VLOOKUP('Cronograma'!$E20,ListadoDeTemas1[[Tema]:[Bloque]],COLUMNS('Cronograma'!$E20:G20),FALSE),\"\")","v":""},{"$f":"IFERROR(VLOOKUP('Cronograma'!$E20,ListadoDeTemas1[[Tema]:[Bloque]],COLUMNS('Cronograma'!$E20:H20),FALSE),\"\")","v":""}]
[null,null,null,null,null,{"$f":"IFERROR(VLOOKUP('Cronograma'!$E21,ListadoDeTemas1[[Tema]:[Bloque]],COLUMNS('Cronograma'!$E21:F21),FALSE),\"\")","v":""},{"$f":"IFERROR(VLOOKUP('Cronograma'!$E21,ListadoDeTemas1[[Tema]:[Bloque]],COLUMNS('Cronograma'!$E21:G21),FALSE),\"\")","v":""},{"$f":"IFERROR(VLOOKUP('Cronograma'!$E21,ListadoDeTemas1[[Tema]:[Bloque]],COLUMNS('Cronograma'!$E21:H21),FALSE),\"\")","v":""}]
[null,null,null,null,null,{"$f":"IFERROR(VLOOKUP('Cronograma'!$E22,ListadoDeTemas1[[Tema]:[Bloque]],COLUMNS('Cronograma'!$E22:F22),FALSE),\"\")","v":""},{"$f":"IFERROR(VLOOKUP('Cronograma'!$E22,ListadoDeTemas1[[Tema]:[Bloque]],COLUMNS('Cronograma'!$E22:G22),FALSE),\"\")","v":""},{"$f":"IFERROR(VLOOKUP('Cronograma'!$E22,ListadoDeTemas1[[Tema]:[Bloque]],COLUMNS('Cronograma'!$E22:H22),FALSE),\"\")","v":""}]
[null,null,null,null,null,{"$f":"IFERROR(VLOOKUP('Cronograma'!$E23,ListadoDeTemas1[[Tema]:[Bloque]],COLUMNS('Cronograma'!$E23:F23),FALSE),\"\")","v":""},{"$f":"IFERROR(VLOOKUP('Cronograma'!$E23,ListadoDeTemas1[[Tema]:[Bloque]],COLUMNS('Cronograma'!$E23:G23),FALSE),\"\")","v":""},{"$f":"IFERROR(VLOOKUP('Cronograma'!$E23,ListadoDeTemas1[[Tema]:[Bloque]],COLUMNS('Cronograma'!$E23:H23),FALSE),\"\")","v":""}]
[null,null,null,null,null,{"$f":"IFERROR(VLOOKUP('Cronograma'!$E24,ListadoDeTemas1[[Tema]:[Bloque]],COLUMNS('Cronograma'!$E24:F24),FALSE),\"\")","v":""},{"$f":"IFERROR(VLOOKUP('Cronograma'!$E24,ListadoDeTemas1[[Tema]:[Bloque]],COLUMNS('Cronograma'!$E24:G24),FALSE),\"\")","v":""},{"$f":"IFERROR(VLOOKUP('Cronograma'!$E24,ListadoDeTemas1[[Tema]:[Bloque]],COLUMNS('Cronograma'!$E24:H24),FALSE),\"\")","v":""}]
[null,null,null,null,null,{"$f":"IFERROR(VLOOKUP('Cronograma'!$E25,ListadoDeTemas1[[Tema]:[Bloque]],COLUMNS('Cronograma'!$E25:F25),FALSE),\"\")","v":""},{"$f":"IFERROR(VLOOKUP('Cronograma'!$E25,ListadoDeTemas1[[Tema]:[Bloque]],COLUMNS('Cronograma'!$E25:G25),FALSE),\"\")","v":""},{"$f":"IFERROR(VLOOKUP('Cronograma'!$E25,ListadoDeTemas1[[Tema]:[Bloque]],COLUMNS('Cronograma'!$E25:H25),FALSE),\"\")","v":""}]
[null,null,null,null,null,{"$f":"IFERROR(VLOOKUP('Cronograma'!$E26,ListadoDeTemas1[[Tema]:[Bloque]],COLUMNS('Cronograma'!$E26:F26),FALSE),\"\")","v":""},{"$f":"IFERROR(VLOOKUP('Cronograma'!$E26,ListadoDeTemas1[[Tema]:[Bloque]],COLUMNS('Cronograma'!$E26:G26),FALSE),\"\")","v":""},{"$f":"IFERROR(VLOOKUP('Cronograma'!$E26,ListadoDeTemas1[[Tema]:[Bloque]],COLUMNS('Cronograma'!$E26:H26),FALSE),\"\")","v":""}]
[null,null,null,null,null,{"$f":"IFERROR(VLOOKUP('Cronograma'!$E27,ListadoDeTemas1[[Tema]:[Bloque]],COLUMNS('Cronograma'!$E27:F27),FALSE),\"\")","v":""},{"$f":"IFERROR(VLOOKUP('Cronograma'!$E27,ListadoDeTemas1[[Tema]:[Bloque]],COLUMNS('Cronograma'!$E27:G27),FALSE),\"\")","v":""},{"$f":"IFERROR(VLOOKUP('Cronograma'!$E27,ListadoDeTemas1[[Tema]:[Bloque]],COLUMNS('Cronograma'!$E27:H27),FALSE),\"\")","v":""}]
[null,null,null,null,null,{"$f":"IFERROR(VLOOKUP('Cronograma'!$E28,ListadoDeTemas1[[Tema]:[Bloque]],COLUMNS('Cronograma'!$E28:F28),FALSE),\"\")","v":""},{"$f":"IFERROR(VLOOKUP('Cronograma'!$E28,ListadoDeTemas1[[Tema]:[Bloque]],COLUMNS('Cronograma'!$E28:G28),FALSE),\"\")","v":""},{"$f":"IFERROR(VLOOKUP('Cronograma'!$E28,ListadoDeTemas1[[Tema]:[Bloque]],COLUMNS('Cronograma'!$E28:H28),FALSE),\"\")","v":""}]
[null,null,null,null,null,{"$f":"IFERROR(VLOOKUP('Cronograma'!$E29,ListadoDeTemas1[[Tema]:[Bloque]],COLUMNS('Cronograma'!$E29:F29),FALSE),\"\")","v":""},{"$f":"IFERROR(VLOOKUP('Cronograma'!$E29,ListadoDeTemas1[[Tema]:[Bloque]],COLUMNS('Cronograma'!$E29:G29),FALSE),\"\")","v":""},{"$f":"IFERROR(VLOOKUP('Cronograma'!$E29,ListadoDeTemas1[[Tema]:[Bloque]],COLUMNS('Cronograma'!$E29:H29),FALSE),\"\")","v":""}]
[null,null,null,null,null,{"$f":"IFERROR(VLOOKUP('Cronograma'!$E30,ListadoDeTemas1[[Tema]:[Bloque]],COLUMNS('Cronograma'!$E30:F30),FALSE),\"\")","v":""},{"$f":"IFERROR(VLOOKUP('Cronograma'!$E30,ListadoDeTemas1[[Tema]:[Bloque]],COLUMNS('Cronograma'!$E30:G30),FALSE),\"\")","v":""},{"$f":"IFERROR(VLOOKUP('Cronograma'!$E30,ListadoDeTemas1[[Tema]:[Bloque]],COLUMNS('Cronograma'!$E30:H30),FALSE),\"\")","v":""}]
[null,null,null,null,null,{"$f":"IFERROR(VLOOKUP('Cronograma'!$E31,ListadoDeTemas1[[Tema]:[Bloque]],COLUMNS('Cronograma'!$E31:F31),FALSE),\"\")","v":""},{"$f":"IFERROR(VLOOKUP('Cronograma'!$E31,ListadoDeTemas1[[Tema]:[Bloque]],COLUMNS('Cronograma'!$E31:G31),FALSE),\"\")","v":""},{"$f":"IFERROR(VLOOKUP('Cronograma'!$E31,ListadoDeTemas1[[Tema]:[Bloque]],COLUMNS('Cronograma'!$E31:H31),FALSE),\"\")","v":""}]
[null,null,null,null,null,{"$f":"IFERROR(VLOOKUP('Cronograma'!$E32,ListadoDeTemas1[[Tema]:[Bloque]],COLUMNS('Cronograma'!$E32:F32),FALSE),\"\")","v":""},{"$f":"IFERROR(VLOOKUP('Cronograma'!$E32,ListadoDeTemas1[[Tema]:[Bloque]],COLUMNS('Cronograma'!$E32:G32),FALSE),\"\")","v":""},{"$f":"IFERROR(VLOOKUP('Cronograma'!$E32,ListadoDeTemas1[[Tema]:[Bloque]],COLUMNS('Cronograma'!$E32:H32),FALSE),\"\")","v":""}]
[null,null,null,null,null,{"$f":"IFERROR(VLOOKUP('Cronograma'!$E33,ListadoDeTemas1[[Tema]:[Bloque]],COLUMNS('Cronograma'!$E33:F33),FALSE),\"\")","v":""},{"$f":"IFERROR(VLOOKUP('Cronograma'!$E33,ListadoDeTemas1[[Tema]:[Bloque]],COLUMNS('Cronograma'!$E33:G33),FALSE),\"\")","v":""},{"$f":"IFERROR(VLOOKUP('Cronograma'!$E33,ListadoDeTemas1[[Tema]:[Bloque]],COLUMNS('Cronograma'!$E33:H33),FALSE),\"\")","v":""}]
[null,null,null,null,null,{"$f":"IFERROR(VLOOKUP('Cronograma'!$E34,ListadoDeTemas1[[Tema]:[Bloque]],COLUMNS('Cronograma'!$E34:F34),FALSE),\"\")","v":""},{"$f":"IFERROR(VLOOKUP('Cronograma'!$E34,ListadoDeTemas1[[Tema]:[Bloque]],COLUMNS('Cronograma'!$E34:G34),FALSE),\"\")","v":""},{"$f":"IFERROR(VLOOKUP('Cronograma'!$E34,ListadoDeTemas1[[Tema]:[Bloque]],COLUMNS('Cronograma'!$E34:H34),FALSE),\"\")","v":""}]
[null,null,null,null,null,{"$f":"IFERROR(VLOOKUP('Cronograma'!$E35,ListadoDeTemas1[[Tema]:[Bloque]],COLUMNS('Cronograma'!$E35:F35),FALSE),\"\")","v":""},{"$f":"IFERROR(VLOOKUP('Cronograma'!$E35,ListadoDeTemas1[[Tema]:[Bloque]],COLUMNS('Cronograma'!$E35:G35),FALSE),\"\")","v":""},{"$f":"IFERROR(VLOOKUP('Cronograma'!$E35,ListadoDeTemas1[[Tema]:[Bloque]],COLUMNS('Cronograma'!$E35:H35),FALSE),\"\")","v":""}]
[null,null,null,null,null,{"$f":"IFERROR(VLOOKUP('Cronograma'!$E36,ListadoDeTemas1[[Tema]:[Bloque]],COLUMNS('Cronograma'!$E36:F36),FALSE),\"\")","v":""},{"$f":"IFERROR(VLOOKUP('Cronograma'!$E36,ListadoDeTemas1[[Tema]:[Bloque]],COLUMNS('Cronograma'!$E36:G36),FALSE),\"\")","v":""},{"$f":"IFERROR(VLOOKUP('Cronograma'!$E36,ListadoDeTemas1[[Tema]:[Bloque]],COLUMNS('Cronograma'!$E36:H36),FALSE),\"\")","v":""}]
[null,null,null,null,null,{"$f":"IFERROR(VLOOKUP('Cronograma'!$E37,ListadoDeTemas1[[Tema]:[Bloque]],COLUMNS('Cronograma'!$E37:F37),FALSE),\"\")","v":""},{"$f":"IFERROR(VLOOKUP('Cronograma'!$E37,ListadoDeTemas1[[Tema]:[Bloque]],COLUMNS('Cronograma'!$E37:G37),FALSE),\"\")","v":""},{"$f":"IFERROR(VLOOKUP('Cronograma'!$E37,ListadoDeTemas1[[Tema]:[Bloque]],COLUMNS('Cronograma'!$E37:H37),FALSE),\"\")","v":""}]
[null,null,null,null,null,{"$f":"IFERROR(VLOOKUP('Cronograma'!$E38,ListadoDeTemas1[[Tema]:[Bloque]],COLUMNS('Cronograma'!$E38:F38),FALSE),\"\")","v":""},{"$f":"IFERROR(VLOOKUP('Cronograma'!$E38,ListadoDeTemas1[[Tema]:[Bloque]],COLUMNS('Cronograma'!$E38:G38),FALSE),\"\")","v":""},{"$f":"IFERROR(VLOOKUP('Cronograma'!$E38,ListadoDeTemas1[[Tema]:[Bloque]],COLUMNS('Cronograma'!$E38:H38),FALSE),\"\")","v":""}]
[null,null,null,null,null,{"$f":"IFERROR(VLOOKUP('Cronograma'!$E39,ListadoDeTemas1[[Tema]:[Bloque]],COLUMNS('Cronograma'!$E39:F39),FALSE),\"\")","v":""},{"$f":"IFERROR(VLOOKUP('Cronograma'!$E39,ListadoDeTemas1[[Tema]:[Bloque]],COLUMNS('Cronograma'!$E39:G39),FALSE),\"\")","v":""},{"$f":"IFERROR(VLOOKUP('Cronograma'!$E39,ListadoDeTemas1[[Tema]:[Bloque]],COLUMNS('Cronograma'!$E39:H39),FALSE),\"\")","v":""}]
[null,null,null,null,null,{"$f":"IFERROR(VLOOKUP('Cronograma'!$E40,ListadoDeTemas1[[Tema]:[Bloque]],COLUMNS('Cronograma'!$E40:F40),FALSE),\"\")","v":""},{"$f":"IFERROR(VLOOKUP('Cronograma'!$E40,ListadoDeTemas1[[Tema]:[Bloque]],COLUMNS('Cronograma'!$E40:G40),FALSE),\"\")","v":""},{"$f":"IFERROR(VLOOKUP('Cronograma'!$E40,ListadoDeTemas1[[Tema]:[Bloque]],COLUMNS('Cronograma'!$E40:H40),FALSE),\"\")","v":""}]
[null,null,null,null,null,{"$f":"IFERROR(VLOOKUP('Cronograma'!$E41,ListadoDeTemas1[[Tema]:[Bloque]],COLUMNS('Cronograma'!$E41:F41),FALSE),\"\")","v":""},{"$f":"IFERROR(VLOOKUP('Cronograma'!$E41,ListadoDeTemas1[[Tema]:[Bloque]],COLUMNS('Cronograma'!$E41:G41),FALSE),\"\")","v":""},{"$f":"IFERROR(VLOOKUP('Cronograma'!$E41,ListadoDeTemas1[[Tema]:[Bloque]],COLUMNS('Cronograma'!$E41:H41),FALSE),\"\")","v":""}]
[null,null,null,null,null,{"$f":"IFERROR(VLOOKUP('Cronograma'!$E42,ListadoDeTemas1[[Tema]:[Bloque]],COLUMNS('Cronograma'!$E42:F42),FALSE),\"\")","v":""},{"$f":"IFERROR(VLOOKUP('Cronograma'!$E42,ListadoDeTemas1[[Tema]:[Bloque]],COLUMNS('Cronograma'!$E42:G42),FALSE),\"\")","v":""},{"$f":"IFERROR(VLOOKUP('Cronograma'!$E42,ListadoDeTemas1[[Tema]:[Bloque]],COLUMNS('Cronograma'!$E42:H42),FALSE),\"\")","v":""}]
[null,null,null,null,null,{"$f":"IFERROR(VLOOKUP('Cronograma'!$E43,ListadoDeTemas1[[Tema]:[Bloque]],COLUMNS('Cronograma'!$E43:F43),FALSE),\"\")","v":""},{"$f":"IFERROR(VLOOKUP('Cronograma'!$E43,ListadoDeTemas1[[Tema]:[Bloque]],COLUMNS('Cronograma'!$E43:G43),FALSE),\"\")","v":""},{"$f":"IFERROR(VLOOKUP('Cronograma'!$E43,ListadoDeTemas1[[Tema]:[Bloque]],COLUMNS('Cronograma'!$E43:H43),FALSE),\"\")","v":""}]
[null,null,null,null,null,{"$f":"IFERROR(VLOOKUP('Cronograma'!$E44,ListadoDeTemas1[[Tema]:[Bloque]],COLUMNS('Cronograma'!$E44:F44),FALSE),\"\")","v":""},{"$f":"IFERROR(VLOOKUP('Cronograma'!$E44,ListadoDeTemas1[[Tema]:[Bloque]],COLUMNS('Cronograma'!$E44:G44),FALSE),\"\")","v":""},{"$f":"IFERROR(VLOOKUP('Cronograma'!$E44,ListadoDeTemas1[[Tema]:[Bloque]],COLUMNS('Cronograma'!$E44:H44),FALSE),\"\")","v":""}]
[null,null,null,null,null,{"$f":"IFERROR(VLOOKUP('Cronograma'!$E45,ListadoDeTemas1[[Tema]:[Bloque]],COLUMNS('Cronograma'!$E45:F45),FALSE),\"\")","v":""},{"$f":"IFERROR(VLOOKUP('Cronograma'!$E45,ListadoDeTemas1[[Tema]:[Bloque]],COLUMNS('Cronograma'!$E45:G45),FALSE),\"\")","v":""},{"$f":"IFERROR(VLOOKUP('Cronograma'!$E45,ListadoDeTemas1[[Tema]:[Bloque]],COLUMNS('Cronograma'!$E45:H45),FALSE),\"\")","v":""}]
[null,null,null,null,null,{"$f":"IFERROR(VLOOKUP('Cronograma'!$E46,ListadoDeTemas1[[Tema]:[Bloque]],COLUMNS('Cronograma'!$E46:F46),FALSE),\"\")","v":""},{"$f":"IFERROR(VLOOKUP('Cronograma'!$E46,ListadoDeTemas1[[Tema]:[Bloque]],COLUMNS('Cronograma'!$E46:G46),FALSE),\"\")","v":""},{"$f":"IFERROR(VLOOKUP('Cronograma'!$E46,ListadoDeTemas1[[Tema]:[Bloque]],COLUMNS('Cronograma'!$E46:H46),FALSE),\"\")","v":""}]
[null,null,null,null,null,{"$f":"IFERROR(VLOOKUP('Cronograma'!$E47,ListadoDeTemas1[[Tema]:[Bloque]],COLUMNS('Cronograma'!$E47:F47),FALSE),\"\")","v":""},{"$f":"IFERROR(VLOOKUP('Cronograma'!$E47,ListadoDeTemas1[[Tema]:[Bloque]],COLUMNS('Cronograma'!$E47:G47),FALSE),\"\")","v":""},{"$f":"IFERROR(VLOOKUP('Cronograma'!$E47,ListadoDeTemas1[[Tema]:[Bloque]],COLUMNS('Cronograma'!$E47:H47),FALSE),\"\")","v":""}]
[null,null,null,null,null,{"$f":"IFERROR(VLOOKUP('Cronograma'!$E48,ListadoDeTemas1[[Tema]:[Bloque]],COLUMNS('Cronograma'!$E48:F48),FALSE),\"\")","v":""},{"$f":"IFERROR(VLOOKUP('Cronograma'!$E48,ListadoDeTemas1[[Tema]:[Bloque]],COLUMNS('Cronograma'!$E48:G48),FALSE),\"\")","v":""},{"$f":"IFERROR(VLOOKUP('Cronograma'!$E48,ListadoDeTemas1[[Tema]:[Bloque]],COLUMNS('Cronograma'!$E48:H48),FALSE),\"\")","v":""}]
[null,null,null,null,null,{"$f":"IFERROR(VLOOKUP('Cronograma'!$E49,ListadoDeTemas1[[Tema]:[Bloque]],COLUMNS('Cronograma'!$E49:F49),FALSE),\"\")","v":""},{"$f":"IFERROR(VLOOKUP('Cronograma'!$E49,ListadoDeTemas1[[Tema]:[Bloque]],COLUMNS('Cronograma'!$E49:G49),FALSE),\"\")","v":""},{"$f":"IFERROR(VLOOKUP('Cronograma'!$E49,ListadoDeTemas1[[Tema]:[Bloque]],COLUMNS('Cronograma'!$E49:H49),FALSE),\"\")","v":""}]
[null,null,null,null,null,{"$f":"IFERROR(VLOOKUP('Cronograma'!$E50,ListadoDeTemas1[[Tema]:[Bloque]],COLUMNS('Cronograma'!$E50:F50),FALSE),\"\")","v":""},{"$f":"IFERROR(VLOOKUP('Cronograma'!$E50,ListadoDeTemas1[[Tema]:[Bloque]],COLUMNS('Cronograma'!$E50:G50),FALSE),\"\")","v":""},{"$f":"IFERROR(VLOOKUP('Cronograma'!$E50,ListadoDeTemas1[[Tema]:[Bloque]],COLUMNS('Cronograma'!$E50:H50),FALSE),\"\")","v":""}]
[null,null,null,null,null,{"$f":"IFERROR(VLOOKUP('Cronograma'!$E51,ListadoDeTemas1[[Tema]:[Bloque]],COLUMNS('Cronograma'!$E51:F51),FALSE),\"\")","v":""},{"$f":"IFERROR(VLOOKUP('Cronograma'!$E51,ListadoDeTemas1[[Tema]:[Bloque]],COLUMNS('Cronograma'!$E51:G51),FALSE),\"\")","v":""},{"$f":"IFERROR(VLOOKUP('Cronograma'!$E51,ListadoDeTemas1[[Tema]:[Bloque]],COLUMNS('Cronograma'!$E51:H51),FALSE),\"\")","v":""}]
[null,null,null,null,null,{"$f":"IFERROR(VLOOKUP('Cronograma'!$E52,ListadoDeTemas1[[Tema]:[Bloque]],COLUMNS('Cronograma'!$E52:F52),FALSE),\"\")","v":""},{"$f":"IFERROR(VLOOKUP('Cronograma'!$E52,ListadoDeTemas1[[Tema]:[Bloque]],COLUMNS('Cronograma'!$E52:G52),FALSE),\"\")","v":""},{"$f":"IFERROR(VLOOKUP('Cronograma'!$E52,ListadoDeTemas1[[Tema]:[Bloque]],COLUMNS('Cronograma'!$E52:H52),FALSE),\"\")","v":""}]
[null,null,null,null,null,{"$f":"IFERROR(VLOOKUP('Cronograma'!$E53,ListadoDeTemas1[[Tema]:[Bloque]],COLUMNS('Cronograma'!$E53:F53),FALSE),\"\")","v":""},{"$f":"IFERROR(VLOOKUP('Cronograma'!$E53,ListadoDeTemas1[[Tema]:[Bloque]],COLUMNS('Cronograma'!$E53:G53),FALSE),\"\")","v":""},{"$f":"IFERROR(VLOOKUP('Cronograma'!$E53,ListadoDeTemas1[[Tema]:[Bloque]],COLUMNS('Cronograma'!$E53:H53),FALSE),\"\")","v":""}]
[null,null,null,null,null,{"$f":"IFERROR(VLOOKUP('Cronograma'!$E54,ListadoDeTemas1[[Tema]:[Bloque]],COLUMNS('Cronograma'!$E54:F54),FALSE),\"\")","v":""},{"$f":"IFERROR(VLOOKUP('Cronograma'!$E54,ListadoDeTemas1[[Tema]:[Bloque]],COLUMNS('Cronograma'!$E54:G54),FALSE),\"\")","v":""},{"$f":"IFERROR(VLOOKUP('Cronograma'!$E54,ListadoDeTemas1[[Tema]:[Bloque]],COLUMNS('Cronograma'!$E54:H54),FALSE),\"\")","v":""}]
[null,null,null,null,null,{"$f":"IFERROR(VLOOKUP('Cronograma'!$E55,ListadoDeTemas1[[Tema]:[Bloque]],COLUMNS('Cronograma'!$E55:F55),FALSE),\"\")","v":""},{"$f":"IFERROR(VLOOKUP('Cronograma'!$E55,ListadoDeTemas1[[Tema]:[Bloque]],COLUMNS('Cronograma'!$E55:G55),FALSE),\"\")","v":""},{"$f":"IFERROR(VLOOKUP('Cronograma'!$E55,ListadoDeTemas1[[Tema]:[Bloque]],COLUMNS('Cronograma'!$E55:H55),FALSE),\"\")","v":""}]
[null,null,null,null,null,{"$f":"IFERROR(VLOOKUP('Cronograma'!$E56,ListadoDeTemas1[[Tema]:[Bloque]],COLUMNS('Cronograma'!$E56:F56),FALSE),\"\")","v":""},{"$f":"IFERROR(VLOOKUP('Cronograma'!$E56,ListadoDeTemas1[[Tema]:[Bloque]],COLUMNS('Cronograma'!$E56:G56),FALSE),\"\")","v":""},{"$f":"IFERROR(VLOOKUP('Cronograma'!$E56,ListadoDeTemas1[[Tema]:[Bloque]],COLUMNS('Cronograma'!$E56:H56),FALSE),\"\")","v":""}]
[null,null,null,null,null,{"$f":"IFERROR(VLOOKUP('Cronograma'!$E57,ListadoDeTemas1[[Tema]:[Bloque]],COLUMNS('Cronograma'!$E57:F57),FALSE),\"\")","v":""},{"$f":"IFERROR(VLOOKUP('Cronograma'!$E57,ListadoDeTemas1[[Tema]:[Bloque]],COLUMNS('Cronograma'!$E57:G57),FALSE),\"\")","v":""},{"$f":"IFERROR(VLOOKUP('Cronograma'!$E57,ListadoDeTemas1[[Tema]:[Bloque]],COLUMNS('Cronograma'!$E57:H57),FALSE),\"\")","v":""}]
[null,null,null,null,null,{"$f":"IFERROR(VLOOKUP('Cronograma'!$E58,ListadoDeTemas1[[Tema]:[Bloque]],COLUMNS('Cronograma'!$E58:F58),FALSE),\"\")","v":""},{"$f":"IFERROR(VLOOKUP('Cronograma'!$E58,ListadoDeTemas1[[Tema]:[Bloque]],COLUMNS('Cronograma'!$E58:G58),FALSE),\"\")","v":""},{"$f":"IFERROR(VLOOKUP('Cronograma'!$E58,ListadoDeTemas1[[Tema]:[Bloque]],COLUMNS('Cronograma'!$E58:H58),FALSE),\"\")","v":""}]
[null,null,null,null,null,{"$f":"IFERROR(VLOOKUP('Cronograma'!$E59,ListadoDeTemas1[[Tema]:[Bloque]],COLUMNS('Cronograma'!$E59:F59),FALSE),\"\")","v":""},{"$f":"IFERROR(VLOOKUP('Cronograma'!$E59,ListadoDeTemas1[[Tema]:[Bloque]],COLUMNS('Cronograma'!$E59:G59),FALSE),\"\")","v":""},{"$f":"IFERROR(VLOOKUP('Cronograma'!$E59,ListadoDeTemas1[[Tema]:[Bloque]],COLUMNS('Cronograma'!$E59:H59),FALSE),\"\")","v":""}]
[null,null,null,null,null,{"$f":"IFERROR(VLOOKUP('Cronograma'!$E60,ListadoDeTemas1[[Tema]:[Bloque]],COLUMNS('Cronograma'!$E60:F60),FALSE),\"\")","v":""},{"$f":"IFERROR(VLOOKUP('Cronograma'!$E60,ListadoDeTemas1[[Tema]:[Bloque]],COLUMNS('Cronograma'!$E60:G60),FALSE),\"\")","v":""},{"$f":"IFERROR(VLOOKUP('Cronograma'!$E60,ListadoDeTemas1[[Tema]:[Bloque]],COLUMNS('Cronograma'!$E60:H60),FALSE),\"\")","v":""}]
[null,null,null,null,null,{"$f":"IFERROR(VLOOKUP('Cronograma'!$E61,ListadoDeTemas1[[Tema]:[Bloque]],COLUMNS('Cronograma'!$E61:F61),FALSE),\"\")","v":""},{"$f":"IFERROR(VLOOKUP('Cronograma'!$E61,ListadoDeTemas1[[Tema]:[Bloque]],COLUMNS('Cronograma'!$E61:G61),FALSE),\"\")","v":""},{"$f":"IFERROR(VLOOKUP('Cronograma'!$E61,ListadoDeTemas1[[Tema]:[Bloque]],COLUMNS('Cronograma'!$E61:H61),FALSE),\"\")","v":""}]
[null,null,null,null,null,{"$f":"IFERROR(VLOOKUP('Cronograma'!$E62,ListadoDeTemas1[[Tema]:[Bloque]],COLUMNS('Cronograma'!$E62:F62),FALSE),\"\")","v":""},{"$f":"IFERROR(VLOOKUP('Cronograma'!$E62,ListadoDeTemas1[[Tema]:[Bloque]],COLUMNS('Cronograma'!$E62:G62),FALSE),\"\")","v":""},{"$f":"IFERROR(VLOOKUP('Cronograma'!$E62,ListadoDeTemas1[[Tema]:[Bloque]],COLUMNS('Cronograma'!$E62:H62),FALSE),\"\")","v":""}]
[null,null,null,null,null,{"$f":"IFERROR(VLOOKUP('Cronograma'!$E63,ListadoDeTemas1[[Tema]:[Bloque]],COLUMNS('Cronograma'!$E63:F63),FALSE),\"\")","v":""},{"$f":"IFERROR(VLOOKUP('Cronograma'!$E63,ListadoDeTemas1[[Tema]:[Bloque]],COLUMNS('Cronograma'!$E63:G63),FALSE),\"\")","v":""},{"$f":"IFERROR(VLOOKUP('Cronograma'!$E63,ListadoDeTemas1[[Tema]:[Bloque]],COLUMNS('Cronograma'!$E63:H63),FALSE),\"\")","v":""}]
[null,null,null,null,null,{"$f":"IFERROR(VLOOKUP('Cronograma'!$E64,ListadoDeTemas1[[Tema]:[Bloque]],COLUMNS('Cronograma'!$E64:F64),FALSE),\"\")","v":""},{"$f":"IFERROR(VLOOKUP('Cronograma'!$E64,ListadoDeTemas1[[Tema]:[Bloque]],COLUMNS('Cronograma'!$E64:G64),FALSE),\"\")","v":""},{"$f":"IFERROR(VLOOKUP('Cronograma'!$E64,ListadoDeTemas1[[Tema]:[Bloque]],COLUMNS('Cronograma'!$E64:H64),FALSE),\"\")","v":""}]
[null,null,null,null,null,{"$f":"IFERROR(VLOOKUP('Cronograma'!$E65,ListadoDeTemas1[[Tema]:[Bloque]],COLUMNS('Cronograma'!$E65:F65),FALSE),\"\")","v":""},{"$f":"IFERROR(VLOOKUP('Cronograma'!$E65,ListadoDeTemas1[[Tema]:[Bloque]],COLUMNS('Cronograma'!$E65:G65),FALSE),\"\")","v":""},{"$f":"IFERROR(VLOOKUP('Cronograma'!$E65,ListadoDeTemas1[[Tema]:[Bloque]],COLUMNS('Cronograma'!$E65:H65),FALSE),\"\")","v":""}]
[null,null,null,null,null,{"$f":"IFERROR(VLOOKUP('Cronograma'!$E66,ListadoDeTemas1[[Tema]:[Bloque]],COLUMNS('Cronograma'!$E66:F66),FALSE),\"\")","v":""},{"$f":"IFERROR(VLOOKUP('Cronograma'!$E66,ListadoDeTemas1[[Tema]:[Bloque]],COLUMNS('Cronograma'!$E66:G66),FALSE),\"\")","v":""},{"$f":"IFERROR(VLOOKUP('Cronograma'!$E66,ListadoDeTemas1[[Tema]:[Bloque]],COLUMNS('Cronograma'!$E66:H66),FALSE),\"\")","v":""}]
[null,null,null,null,null,{"$f":"IFERROR(VLOOKUP('Cronograma'!$E67,ListadoDeTemas1[[Tema]:[Bloque]],COLUMNS('Cronograma'!$E67:F67),FALSE),\"\")","v":""},{"$f":"IFERROR(VLOOKUP('Cronograma'!$E67,ListadoDeTemas1[[Tema]:[Bloque]],COLUMNS('Cronograma'!$E67:G67),FALSE),\"\")","v":""},{"$f":"IFERROR(VLOOKUP('Cronograma'!$E67,ListadoDeTemas1[[Tema]:[Bloque]],COLUMNS('Cronograma'!$E67:H67),FALSE),\"\")","v":""}]
[null,null,null,null,null,{"$f":"IFERROR(VLOOKUP('Cronograma'!$E68,ListadoDeTemas1[[Tema]:[Bloque]],COLUMNS('Cronograma'!$E68:F68),FALSE),\"\")","v":""},{"$f":"IFERROR(VLOOKUP('Cronograma'!$E68,ListadoDeTemas1[[Tema]:[Bloque]],COLUMNS('Cronograma'!$E68:G68),FALSE),\"\")","v":""},{"$f":"IFERROR(VLOOKUP('Cronograma'!$E68,ListadoDeTemas1[[Tema]:[Bloque]],COLUMNS('Cronograma'!$E68:H68),FALSE),\"\")","v":""}]
[null,null,null,null,null,{"$f":"IFERROR(VLOOKUP('Cronograma'!$E69,ListadoDeTemas1[[Tema]:[Bloque]],COLUMNS('Cronograma'!$E69:F69),FALSE),\"\")","v":""},{"$f":"IFERROR(VLOOKUP('Cronograma'!$E69,ListadoDeTemas1[[Tema]:[Bloque]],COLUMNS('Cronograma'!$E69:G69),FALSE),\"\")","v":""},{"$f":"IFERROR(VLOOKUP('Cronograma'!$E69,ListadoDeTemas1[[Tema]:[Bloque]],COLUMNS('Cronograma'!$E69:H69),FALSE),\"\")","v":""}]
[null,null,null,null,null,{"$f":"IFERROR(VLOOKUP('Cronograma'!$E70,ListadoDeTemas1[[Tema]:[Bloque]],COLUMNS('Cronograma'!$E70:F70),FALSE),\"\")","v":""},{"$f":"IFERROR(VLOOKUP('Cronograma'!$E70,ListadoDeTemas1[[Tema]:[Bloque]],COLUMNS('Cronograma'!$E70:G70),FALSE),\"\")","v":""},{"$f":"IFERROR(VLOOKUP('Cronograma'!$E70,ListadoDeTemas1[[Tema]:[Bloque]],COLUMNS('Cronograma'!$E70:H70),FALSE),\"\")","v":""}]
[null,null,null,null,null,{"$f":"IFERROR(VLOOKUP('Cronograma'!$E71,ListadoDeTemas1[[Tema]:[Bloque]],COLUMNS('Cronograma'!$E71:F71),FALSE),\"\")","v":""},{"$f":"IFERROR(VLOOKUP('Cronograma'!$E71,ListadoDeTemas1[[Tema]:[Bloque]],COLUMNS('Cronograma'!$E71:G71),FALSE),\"\")","v":""},{"$f":"IFERROR(VLOOKUP('Cronograma'!$E71,ListadoDeTemas1[[Tema]:[Bloque]],COLUMNS('Cronograma'!$E71:H71),FALSE),\"\")","v":""}]
[null,null,null,null,null,{"$f":"IFERROR(VLOOKUP('Cronograma'!$E72,ListadoDeTemas1[[Tema]:[Bloque]],COLUMNS('Cronograma'!$E72:F72),FALSE),\"\")","v":""},{"$f":"IFERROR(VLOOKUP('Cronograma'!$E72,ListadoDeTemas1[[Tema]:[Bloque]],COLUMNS('Cronograma'!$E72:G72),FALSE),\"\")","v":""},{"$f":"IFERROR(VLOOKUP('Cronograma'!$E72,ListadoDeTemas1[[Tema]:[Bloque]],COLUMNS('Cronograma'!$E72:H72),FALSE),\"\")","v":""}]
[null,null,null,null,null,{"$f":"IFERROR(VLOOKUP('Cronograma'!$E73,ListadoDeTemas1[[Tema]:[Bloque]],COLUMNS('Cronograma'!$E73:F73),FALSE),\"\")","v":""},{"$f":"IFERROR(VLOOKUP('Cronograma'!$E73,ListadoDeTemas1[[Tema]:[Bloque]],COLUMNS('Cronograma'!$E73:G73),FALSE),\"\")","v":""},{"$f":"IFERROR(VLOOKUP('Cronograma'!$E73,ListadoDeTemas1[[Tema]:[Bloque]],COLUMNS('Cronograma'!$E73:H73),FALSE),\"\")","v":""}]
[null,null,null,null,null,{"$f":"IFERROR(VLOOKUP('Cronograma'!$E74,ListadoDeTemas1[[Tema]:[Bloque]],COLUMNS('Cronograma'!$E74:F74),FALSE),\"\")","v":""},{"$f":"IFERROR(VLOOKUP('Cronograma'!$E74,ListadoDeTemas1[[Tema]:[Bloque]],COLUMNS('Cronograma'!$E74:G74),FALSE),\"\")","v":""},{"$f":"IFERROR(VLOOKUP('Cronograma'!$E74,ListadoDeTemas1[[Tema]:[Bloque]],COLUMNS('Cronograma'!$E74:H74),FALSE),\"\")","v":""}]
[null,null,null,null,null,{"$f":"IFERROR(VLOOKUP('Cronograma'!$E75,ListadoDeTemas1[[Tema]:[Bloque]],COLUMNS('Cronograma'!$E75:F75),FALSE),\"\")","v":""},{"$f":"IFERROR(VLOOKUP('Cronograma'!$E75,ListadoDeTemas1[[Tema]:[Bloque]],COLUMNS('Cronograma'!$E75:G75),FALSE),\"\")","v":""},{"$f":"IFERROR(VLOOKUP('Cronograma'!$E75,ListadoDeTemas1[[Tema]:[Bloque]],COLUMNS('Cronograma'!$E75:H75),FALSE),\"\")","v":""}]
[null,null,null,null,null,{"$f":"IFERROR(VLOOKUP('Cronograma'!$E76,ListadoDeTemas1[[Tema]:[Bloque]],COLUMNS('Cronograma'!$E76:F76),FALSE),\"\")","v":""},{"$f":"IFERROR(VLOOKUP('Cronograma'!$E76,ListadoDeTemas1[[Tema]:[Bloque]],COLUMNS('Cronograma'!$E76:G76),FALSE),\"\")","v":""},{"$f":"IFERROR(VLOOKUP('Cronograma'!$E76,ListadoDeTemas1[[Tema]:[Bloque]],COLUMNS('Cronograma'!$E76:H76),FALSE),\"\")","v":""}]
[null,null,null,null,null,{"$f":"IFERROR(VLOOKUP('Cronograma'!$E77,ListadoDeTemas1[[Tema]:[Bloque]],COLUMNS('Cronograma'!$E77:F77),FALSE),\"\")","v":""},{"$f":"IFERROR(VLOOKUP('Cronograma'!$E77,ListadoDeTemas1[[Tema]:[Bloque]],COLUMNS('Cronograma'!$E77:G77),FALSE),\"\")","v":""},{"$f":"IFERROR(VLOOKUP('Cronograma'!$E77,ListadoDeTemas1[[Tema]:[Bloque]],COLUMNS('Cronograma'!$E77:H77),FALSE),\"\")","v":""}]
[null,null,null,null,null,{"$f":"IFERROR(VLOOKUP('Cronograma'!$E78,ListadoDeTemas1[[Tema]:[Bloque]],COLUMNS('Cronograma'!$E78:F78),FALSE),\"\")","v":""},{"$f":"IFERROR(VLOOKUP('Cronograma'!$E78,ListadoDeTemas1[[Tema]:[Bloque]],COLUMNS('Cronograma'!$E78:G78),FALSE),\"\")","v":""},{"$f":"IFERROR(VLOOKUP('Cronograma'!$E78,ListadoDeTemas1[[Tema]:[Bloque]],COLUMNS('Cronograma'!$E78:H78),FALSE),\"\")","v":""}]
[null,null,null,null,null,{"$f":"IFERROR(VLOOKUP('Cronograma'!$E79,ListadoDeTemas1[[Tema]:[Bloque]],COLUMNS('Cronograma'!$E79:F79),FALSE),\"\")","v":""},{"$f":"IFERROR(VLOOKUP('Cronograma'!$E79,ListadoDeTemas1[[Tema]:[Bloque]],COLUMNS('Cronograma'!$E79:G79),FALSE),\"\")","v":""},{"$f":"IFERROR(VLOOKUP('Cronograma'!$E79,ListadoDeTemas1[[Tema]:[Bloque]],COLUMNS('Cronograma'!$E79:H79),FALSE),\"\")","v":""}]
[null,null,null,null,null,{"$f":"IFERROR(VLOOKUP('Cronograma'!$E80,ListadoDeTemas1[[Tema]:[Bloque]],COLUMNS('Cronograma'!$E80:F80),FALSE),\"\")","v":""},{"$f":"IFERROR(VLOOKUP('Cronograma'!$E80,ListadoDeTemas1[[Tema]:[Bloque]],COLUMNS('Cronograma'!$E80:G80),FALSE),\"\")","v":""},{"$f":"IFERROR(VLOOKUP('Cronograma'!$E80,ListadoDeTemas1[[Tema]:[Bloque]],COLUMNS('Cronograma'!$E80:H80),FALSE),\"\")","v":""}]
[null,null,null,null,null,{"$f":"IFERROR(VLOOKUP('Cronograma'!$E81,ListadoDeTemas1[[Tema]:[Bloque]],COLUMNS('Cronograma'!$E81:F81),FALSE),\"\")","v":""},{"$f":"IFERROR(VLOOKUP('Cronograma'!$E81,ListadoDeTemas1[[Tema]:[Bloque]],COLUMNS('Cronograma'!$E81:G81),FALSE),\"\")","v":""},{"$f":"IFERROR(VLOOKUP('Cronograma'!$E81,ListadoDeTemas1[[Tema]:[Bloque]],COLUMNS('Cronograma'!$E81:H81),FALSE),\"\")","v":""}]
[null,null,null,null,null,{"$f":"IFERROR(VLOOKUP('Cronograma'!$E82,ListadoDeTemas1[[Tema]:[Bloque]],COLUMNS('Cronograma'!$E82:F82),FALSE),\"\")","v":""},{"$f":"IFERROR(VLOOKUP('Cronograma'!$E82,ListadoDeTemas1[[Tema]:[Bloque]],COLUMNS('Cronograma'!$E82:G82),FALSE),\"\")","v":""},{"$f":"IFERROR(VLOOKUP('Cronograma'!$E82,ListadoDeTemas1[[Tema]:[Bloque]],COLUMNS('Cronograma'!$E82:H82),FALSE),\"\")","v":""}]
[null,null,null,null,null,{"$f":"IFERROR(VLOOKUP('Cronograma'!$E83,ListadoDeTemas1[[Tema]:[Bloque]],COLUMNS('Cronograma'!$E83:F83),FALSE),\"\")","v":""},{"$f":"IFERROR(VLOOKUP('Cronograma'!$E83,ListadoDeTemas1[[Tema]:[Bloque]],COLUMNS('Cronograma'!$E83:G83),FALSE),\"\")","v":""},{"$f":"IFERROR(VLOOKUP('Cronograma'!$E83,ListadoDeTemas1[[Tema]:[Bloque]],COLUMNS('Cronograma'!$E83:H83),FALSE),\"\")","v":""}]
[null,null,null,null,null,{"$f":"IFERROR(VLOOKUP('Cronograma'!$E84,ListadoDeTemas1[[Tema]:[Bloque]],COLUMNS('Cronograma'!$E84:F84),FALSE),\"\")","v":""},{"$f":"IFERROR(VLOOKUP('Cronograma'!$E84,ListadoDeTemas1[[Tema]:[Bloque]],COLUMNS('Cronograma'!$E84:G84),FALSE),\"\")","v":""},{"$f":"IFERROR(VLOOKUP('Cronograma'!$E84,ListadoDeTemas1[[Tema]:[Bloque]],COLUMNS('Cronograma'!$E84:H84),FALSE),\"\")","v":""}]
[null,null,null,null,null,{"$f":"IFERROR(VLOOKUP('Cronograma'!$E85,ListadoDeTemas1[[Tema]:[Bloque]],COLUMNS('Cronograma'!$E85:F85),FALSE),\"\")","v":""},{"$f":"IFERROR(VLOOKUP('Cronograma'!$E85,ListadoDeTemas1[[Tema]:[Bloque]],COLUMNS('Cronograma'!$E85:G85),FALSE),\"\")","v":""},{"$f":"IFERROR(VLOOKUP('Cronograma'!$E85,ListadoDeTemas1[[Tema]:[Bloque]],COLUMNS('Cronograma'!$E85:H85),FALSE),\"\")","v":""}]
[null,null,null,null,null,{"$f":"IFERROR(VLOOKUP('Cronograma'!$E86,ListadoDeTemas1[[Tema]:[Bloque]],COLUMNS('Cronograma'!$E86:F86),FALSE),\"\")","v":""},{"$f":"IFERROR(VLOOKUP('Cronograma'!$E86,ListadoDeTemas1[[Tema]:[Bloque]],COLUMNS('Cronograma'!$E86:G86),FALSE),\"\")","v":""},{"$f":"IFERROR(VLOOKUP('Cronograma'!$E86,ListadoDeTemas1[[Tema]:[Bloque]],COLUMNS('Cronograma'!$E86:H86),FALSE),\"\")","v":""}]
[null,null,null,null,null,{"$f":"IFERROR(VLOOKUP('Cronograma'!$E87,ListadoDeTemas1[[Tema]:[Bloque]],COLUMNS('Cronograma'!$E87:F87),FALSE),\"\")","v":""},{"$f":"IFERROR(VLOOKUP('Cronograma'!$E87,ListadoDeTemas1[[Tema]:[Bloque]],COLUMNS('Cronograma'!$E87:G87),FALSE),\"\")","v":""},{"$f":"IFERROR(VLOOKUP('Cronograma'!$E87,ListadoDeTemas1[[Tema]:[Bloque]],COLUMNS('Cronograma'!$E87:H87),FALSE),\"\")","v":""}]
[null,null,null,null,null,{"$f":"IFERROR(VLOOKUP('Cronograma'!$E88,ListadoDeTemas1[[Tema]:[Bloque]],COLUMNS('Cronograma'!$E88:F88),FALSE),\"\")","v":""},{"$f":"IFERROR(VLOOKUP('Cronograma'!$E88,ListadoDeTemas1[[Tema]:[Bloque]],COLUMNS('Cronograma'!$E88:G88),FALSE),\"\")","v":""},{"$f":"IFERROR(VLOOKUP('Cronograma'!$E88,ListadoDeTemas1[[Tema]:[Bloque]],COLUMNS('Cronograma'!$E88:H88),FALSE),\"\")","v":""}]
[null,null,null,null,null,{"$f":"IFERROR(VLOOKUP('Cronograma'!$E89,ListadoDeTemas1[[Tema]:[Bloque]],COLUMNS('Cronograma'!$E89:F89),FALSE),\"\")","v":""},{"$f":"IFERROR(VLOOKUP('Cronograma'!$E89,ListadoDeTemas1[[Tema]:[Bloque]],COLUMNS('Cronograma'!$E89:G89),FALSE),\"\")","v":""},{"$f":"IFERROR(VLOOKUP('Cronograma'!$E89,ListadoDeTemas1[[Tema]:[Bloque]],COLUMNS('Cronograma'!$E89:H89),FALSE),\"\")","v":""}]
[null,null,null,null,null,{"$f":"IFERROR(VLOOKUP('Cronograma'!$E90,ListadoDeTemas1[[Tema]:[Bloque]],COLUMNS('Cronograma'!$E90:F90),FALSE),\"\")","v":""},{"$f":"IFERROR(VLOOKUP('Cronograma'!$E90,ListadoDeTemas1[[Tema]:[Bloque]],COLUMNS('Cronograma'!$E90:G90),FALSE),\"\")","v":""},{"$f":"IFERROR(VLOOKUP('Cronograma'!$E90,ListadoDeTemas1[[Tema]:[Bloque]],COLUMNS('Cronograma'!$E90:H90),FALSE),\"\")","v":""}]
[null,null,null,null,null,{"$f":"IFERROR(VLOOKUP('Cronograma'!$E91,ListadoDeTemas1[[Tema]:[Bloque]],COLUMNS('Cronograma'!$E91:F91),FALSE),\"\")","v":""},{"$f":"IFERROR(VLOOKUP('Cronograma'!$E91,ListadoDeTemas1[[Tema]:[Bloque]],COLUMNS('Cronograma'!$E91:G91),FALSE),\"\")","v":""},{"$f":"IFERROR(VLOOKUP('Cronograma'!$E91,ListadoDeTemas1[[Tema]:[Bloque]],COLUMNS('Cronograma'!$E91:H91),FALSE),\"\")","v":""}]
[null,null,null,null,null,{"$f":"IFERROR(VLOOKUP('Cronograma'!$E92,ListadoDeTemas1[[Tema]:[Bloque]],COLUMNS('Cronograma'!$E92:F92),FALSE),\"\")","v":""},{"$f":"IFERROR(VLOOKUP('Cronograma'!$E92,ListadoDeTemas1[[Tema]:[Bloque]],COLUMNS('Cronograma'!$E92:G92),FALSE),\"\")","v":""},{"$f":"IFERROR(VLOOKUP('Cronograma'!$E92,ListadoDeTemas1[[Tema]:[Bloque]],COLUMNS('Cronograma'!$E92:H92),FALSE),\"\")","v":""}]
[null,null,null,null,null,{"$f":"IFERROR(VLOOKUP('Cronograma'!$E93,ListadoDeTemas1[[Tema]:[Bloque]],COLUMNS('Cronograma'!$E93:F93),FALSE),\"\")","v":""},{"$f":"IFERROR(VLOOKUP('Cronograma'!$E93,ListadoDeTemas1[[Tema]:[Bloque]],COLUMNS('Cronograma'!$E93:G93),FALSE),\"\")","v":""},{"$f":"IFERROR(VLOOKUP('Cronograma'!$E93,ListadoDeTemas1[[Tema]:[Bloque]],COLUMNS('Cronograma'!$E93:H93),FALSE),\"\")","v":""}]
[null,null,null,null,null,{"$f":"IFERROR(VLOOKUP('Cronograma'!$E94,ListadoDeTemas1[[Tema]:[Bloque]],COLUMNS('Cronograma'!$E94:F94),FALSE),\"\")","v":""},{"$f":"IFERROR(VLOOKUP('Cronograma'!$E94,ListadoDeTemas1[[Tema]:[Bloque]],COLUMNS('Cronograma'!$E94:G94),FALSE),\"\")","v":""},{"$f":"IFERROR(VLOOKUP('Cronograma'!$E94,ListadoDeTemas1[[Tema]:[Bloque]],COLUMNS('Cronograma'!$E94:H94),FALSE),\"\")","v":""}]
[null,null,null,null,null,{"$f":"IFERROR(VLOOKUP('Cronograma'!$E95,ListadoDeTemas1[[Tema]:[Bloque]],COLUMNS('Cronograma'!$E95:F95),FALSE),\"\")","v":""},{"$f":"IFERROR(VLOOKUP('Cronograma'!$E95,ListadoDeTemas1[[Tema]:[Bloque]],COLUMNS('Cronograma'!$E95:G95),FALSE),\"\")","v":""},{"$f":"IFERROR(VLOOKUP('Cronograma'!$E95,ListadoDeTemas1[[Tema]:[Bloque]],COLUMNS('Cronograma'!$E95:H95),FALSE),\"\")","v":""}]
[null,null,null,null,null,{"$f":"IFERROR(VLOOKUP('Cronograma'!$E96,ListadoDeTemas1[[Tema]:[Bloque]],COLUMNS('Cronograma'!$E96:F96),FALSE),\"\")","v":""},{"$f":"IFERROR(VLOOKUP('Cronograma'!$E96,ListadoDeTemas1[[Tema]:[Bloque]],COLUMNS('Cronograma'!$E96:G96),FALSE),\"\")","v":""},{"$f":"IFERROR(VLOOKUP('Cronograma'!$E96,ListadoDeTemas1[[Tema]:[Bloque]],COLUMNS('Cronograma'!$E96:H96),FALSE),\"\")","v":""}]
[null,null,null,null,null,{"$f":"IFERROR(VLOOKUP('Cronograma'!$E97,ListadoDeTemas1[[Tema]:[Bloque]],COLUMNS('Cronograma'!$E97:F97),FALSE),\"\")","v":""},{"$f":"IFERROR(VLOOKUP('Cronograma'!$E97,ListadoDeTemas1[[Tema]:[Bloque]],COLUMNS('Cronograma'!$E97:G97),FALSE),\"\")","v":""},{"$f":"IFERROR(VLOOKUP('Cronograma'!$E97,ListadoDeTemas1[[Tema]:[Bloque]],COLUMNS('Cronograma'!$E97:H97),FALSE),\"\")","v":""}]
[null,null,null,null,null,{"$f":"IFERROR(VLOOKUP('Cronograma'!$E98,ListadoDeTemas1[[Tema]:[Bloque]],COLUMNS('Cronograma'!$E98:F98),FALSE),\"\")","v":""},{"$f":"IFERROR(VLOOKUP('Cronograma'!$E98,ListadoDeTemas1[[Tema]:[Bloque]],COLUMNS('Cronograma'!$E98:G98),FALSE),\"\")","v":""},{"$f":"IFERROR(VLOOKUP('Cronograma'!$E98,ListadoDeTemas1[[Tema]:[Bloque]],COLUMNS('Cronograma'!$E98:H98),FALSE),\"\")","v":""}]
[null,null,null,null,null,{"$f":"IFERROR(VLOOKUP('Cronograma'!$E99,ListadoDeTemas1[[Tema]:[Bloque]],COLUMNS('Cronograma'!$E99:F99),FALSE),\"\")","v":""},{"$f":"IFERROR(VLOOKUP('Cronograma'!$E99,ListadoDeTemas1[[Tema]:[Bloque]],COLUMNS('Cronograma'!$E99:G99),FALSE),\"\")","v":""},{"$f":"IFERROR(VLOOKUP('Cronograma'!$E99,ListadoDeTemas1[[Tema]:[Bloque]],COLUMNS('Cronograma'!$E99:H99),FALSE),\"\")","v":""}]
[null,null,null,null,null,{"$f":"IFERROR(VLOOKUP('Cronograma'!$E100,ListadoDeTemas1[[Tema]:[Bloque]],COLUMNS('Cronograma'!$E100:F100),FALSE),\"\")","v":""},{"$f":"IFERROR(VLOOKUP('Cronograma'!$E100,ListadoDeTemas1[[Tema]:[Bloque]],COLUMNS('Cronograma'!$E100:G100),FALSE),\"\")","v":""},{"$f":"IFERROR(VLOOKUP('Cronograma'!$E100,ListadoDeTemas1[[Tema]:[Bloque]],COLUMNS('Cronograma'!$E100:H100),FALSE),\"\")","v":""}]
[null,null,null,null,null,{"$f":"IFERROR(VLOOKUP('Cronograma'!$E101,ListadoDeTemas1[[Tema]:[Bloque]],COLUMNS('Cronograma'!$E101:F101),FALSE),\"\")","v":""},{"$f":"IFERROR(VLOOKUP('Cronograma'!$E101,ListadoDeTemas1[[Tema]:[Bloque]],COLUMNS('Cronograma'!$E101:G101),FALSE),\"\")","v":""},{"$f":"IFERROR(VLOOKUP('Cronograma'!$E101,ListadoDeTemas1[[Tema]:[Bloque]],COLUMNS('Cronograma'!$E101:H101),FALSE),\"\")","v":""}]
[null,null,null,null,null,{"$f":"IFERROR(VLOOKUP('Cronograma'!$E102,ListadoDeTemas1[[Tema]:[Bloque]],COLUMNS('Cronograma'!$E102:F102),FALSE),\"\")","v":""},{"$f":"IFERROR(VLOOKUP('Cronograma'!$E102,ListadoDeTemas1[[Tema]:[Bloque]],COLUMNS('Cronograma'!$E102:G102),FALSE),\"\")","v":""},{"$f":"IFERROR(VLOOKUP('Cronograma'!$E102,ListadoDeTemas1[[Tema]:[Bloque]],COLUMNS('Cronograma'!$E102:H102),FALSE),\"\")","v":""}]
[null,null,null,null,null,{"$f":"IFERROR(VLOOKUP('Cronograma'!$E103,ListadoDeTemas1[[Tema]:[Bloque]],COLUMNS('Cronograma'!$E103:F103),FALSE),\"\")","v":""},{"$f":"IFERROR(VLOOKUP('Cronograma'!$E103,ListadoDeTemas1[[Tema]:[Bloque]],COLUMNS('Cronograma'!$E103:G103),FALSE),\"\")","v":""},{"$f":"IFERROR(VLOOKUP('Cronograma'!$E103,ListadoDeTemas1[[Tema]:[Bloque]],COLUMNS('Cronograma'!$E103:H103),FALSE),\"\")","v":""}]
[null,null,null,null,null,{"$f":"IFERROR(VLOOKUP('Cronograma'!$E104,ListadoDeTemas1[[Tema]:[Bloque]],COLUMNS('Cronograma'!$E104:F104),FALSE),\"\")","v":""},{"$f":"IFERROR(VLOOKUP('Cronograma'!$E104,ListadoDeTemas1[[Tema]:[Bloque]],COLUMNS('Cronograma'!$E104:G104),FALSE),\"\")","v":""},{"$f":"IFERROR(VLOOKUP('Cronograma'!$E104,ListadoDeTemas1[[Tema]:[Bloque]],COLUMNS('Cronograma'!$E104:H104),FALSE),\"\")","v":""}]
[null,null,null,null,null,{"$f":"IFERROR(VLOOKUP('Cronograma'!$E105,ListadoDeTemas1[[Tema]:[Bloque]],COLUMNS('Cronograma'!$E105:F105),FALSE),\"\")","v":""},{"$f":"IFERROR(VLOOKUP('Cronograma'!$E105,ListadoDeTemas1[[Tema]:[Bloque]],COLUMNS('Cronograma'!$E105:G105),FALSE),\"\")","v":""},{"$f":"IFERROR(VLOOKUP('Cronograma'!$E105,ListadoDeTemas1[[Tema]:[Bloque]],COLUMNS('Cronograma'!$E105:H105),FALSE),\"\")","v":""}]
[null,null,null,null,null,{"$f":"IFERROR(VLOOKUP('Cronograma'!$E106,ListadoDeTemas1[[Tema]:[Bloque]],COLUMNS('Cronograma'!$E106:F106),FALSE),\"\")","v":""},{"$f":"IFERROR(VLOOKUP('Cronograma'!$E106,ListadoDeTemas1[[Tema]:[Bloque]],COLUMNS('Cronograma'!$E106:G106),FALSE),\"\")","v":""},{"$f":"IFERROR(VLOOKUP('Cronograma'!$E106,ListadoDeTemas1[[Tema]:[Bloque]],COLUMNS('Cronograma'!$E106:H106),FALSE),\"\")","v":""}]
[null,null,null,null,null,{"$f":"IFERROR(VLOOKUP('Cronograma'!$E107,ListadoDeTemas1[[Tema]:[Bloque]],COLUMNS('Cronograma'!$E107:F107),FALSE),\"\")","v":""},{"$f":"IFERROR(VLOOKUP('Cronograma'!$E107,ListadoDeTemas1[[Tema]:[Bloque]],COLUMNS('Cronograma'!$E107:G107),FALSE),\"\")","v":""},{"$f":"IFERROR(VLOOKUP('Cronograma'!$E107,ListadoDeTemas1[[Tema]:[Bloque]],COLUMNS('Cronograma'!$E107:H107),FALSE),\"\")","v":""}]
[null,null,null,null,null,{"$f":"IFERROR(VLOOKUP('Cronograma'!$E108,ListadoDeTemas1[[Tema]:[Bloque]],COLUMNS('Cronograma'!$E108:F108),FALSE),\"\")","v":""},{"$f":"IFERROR(VLOOKUP('Cronograma'!$E108,ListadoDeTemas1[[Tema]:[Bloque]],COLUMNS('Cronograma'!$E108:G108),FALSE),\"\")","v":""},{"$f":"IFERROR(VLOOKUP('Cronograma'!$E108,ListadoDeTemas1[[Tema]:[Bloque]],COLUMNS('Cronograma'!$E108:H108),FALSE),\"\")","v":""}]
[null,null,null,null,null,{"$f":"IFERROR(VLOOKUP('Cronograma'!$E109,ListadoDeTemas1[[Tema]:[Bloque]],COLUMNS('Cronograma'!$E109:F109),FALSE),\"\")","v":""},{"$f":"IFERROR(VLOOKUP('Cronograma'!$E109,ListadoDeTemas1[[Tema]:[Bloque]],COLUMNS('Cronograma'!$E109:G109),FALSE),\"\")","v":""},{"$f":"IFERROR(VLOOKUP('Cronograma'!$E109,ListadoDeTemas1[[Tema]:[Bloque]],COLUMNS('Cronograma'!$E109:H109),FALSE),\"\")","v":""}]
[null,null,null,null,null,{"$f":"IFERROR(VLOOKUP('Cronograma'!$E110,ListadoDeTemas1[[Tema]:[Bloque]],COLUMNS('Cronograma'!$E110:F110),FALSE),\"\")","v":""},{"$f":"IFERROR(VLOOKUP('Cronograma'!$E110,ListadoDeTemas1[[Tema]:[Bloque]],COLUMNS('Cronograma'!$E110:G110),FALSE),\"\")","v":""},{"$f":"IFERROR(VLOOKUP('Cronograma'!$E110,ListadoDeTemas1[[Tema]:[Bloque]],COLUMNS('Cronograma'!$E110:H110),FALSE),\"\")","v":""}]
[null,null,null,null,null,{"$f":"IFERROR(VLOOKUP('Cronograma'!$E111,ListadoDeTemas1[[Tema]:[Bloque]],COLUMNS('Cronograma'!$E111:F111),FALSE),\"\")","v":""},{"$f":"IFERROR(VLOOKUP('Cronograma'!$E111,ListadoDeTemas1[[Tema]:[Bloque]],COLUMNS('Cronograma'!$E111:G111),FALSE),\"\")","v":""},{"$f":"IFERROR(VLOOKUP('Cronograma'!$E111,ListadoDeTemas1[[Tema]:[Bloque]],COLUMNS('Cronograma'!$E111:H111),FALSE),\"\")","v":""}]
[null,null,null,null,null,{"$f":"IFERROR(VLOOKUP('Cronograma'!$E112,ListadoDeTemas1[[Tema]:[Bloque]],COLUMNS('Cronograma'!$E112:F112),FALSE),\"\")","v":""},{"$f":"IFERROR(VLOOKUP('Cronograma'!$E112,ListadoDeTemas1[[Tema]:[Bloque]],COLUMNS('Cronograma'!$E112:G112),FALSE),\"\")","v":""},{"$f":"IFERROR(VLOOKUP('Cronograma'!$E112,ListadoDeTemas1[[Tema]:[Bloque]],COLUMNS('Cronograma'!$E112:H112),FALSE),\"\")","v":""}]
[null,null,null,null,null,{"$f":"IFERROR(VLOOKUP('Cronograma'!$E113,ListadoDeTemas1[[Tema]:[Bloque]],COLUMNS('Cronograma'!$E113:F113),FALSE),\"\")","v":""},{"$f":"IFERROR(VLOOKUP('Cronograma'!$E113,ListadoDeTemas1[[Tema]:[Bloque]],COLUMNS('Cronograma'!$E113:G113),FALSE),\"\")","v":""},{"$f":"IFERROR(VLOOKUP('Cronograma'!$E113,ListadoDeTemas1[[Tema]:[Bloque]],COLUMNS('Cronograma'!$E113:H113),FALSE),\"\")","v":""}]
[null,null,null,null,null,{"$f":"IFERROR(VLOOKUP('Cronograma'!$E114,ListadoDeTemas1[[Tema]:[Bloque]],COLUMNS('Cronograma'!$E114:F114),FALSE),\"\")","v":""},{"$f":"IFERROR(VLOOKUP('Cronograma'!$E114,ListadoDeTemas1[[Tema]:[Bloque]],COLUMNS('Cronograma'!$E114:G114),FALSE),\"\")","v":""},{"$f":"IFERROR(VLOOKUP('Cronograma'!$E114,ListadoDeTemas1[[Tema]:[Bloque]],COLUMNS('Cronograma'!$E114:H114),FALSE),\"\")","v":""}]
[null,null,null,null,null,{"$f":"IFERROR(VLOOKUP('Cronograma'!$E115,ListadoDeTemas1[[Tema]:[Bloque]],COLUMNS('Cronograma'!$E115:F115),FALSE),\"\")","v":""},{"$f":"IFERROR(VLOOKUP('Cronograma'!$E115,ListadoDeTemas1[[Tema]:[Bloque]],COLUMNS('Cronograma'!$E115:G115),FALSE),\"\")","v":""},{"$f":"IFERROR(VLOOKUP('Cronograma'!$E115,ListadoDeTemas1[[Tema]:[Bloque]],COLUMNS('Cronograma'!$E115:H115),FALSE),\"\")","v":""}]
[null,null,null,null,null,{"$f":"IFERROR(VLOOKUP('Cronograma'!$E116,ListadoDeTemas1[[Tema]:[Bloque]],COLUMNS('Cronograma'!$E116:F116),FALSE),\"\")","v":""},{"$f":"IFERROR(VLOOKUP('Cronograma'!$E116,ListadoDeTemas1[[Tema]:[Bloque]],COLUMNS('Cronograma'!$E116:G116),FALSE),\"\")","v":""},{"$f":"IFERROR(VLOOKUP('Cronograma'!$E116,ListadoDeTemas1[[Tema]:[Bloque]],COLUMNS('Cronograma'!$E116:H116),FALSE),\"\")","v":""}]
[null,null,null,null,null,{"$f":"IFERROR(VLOOKUP('Cronograma'!$E117,ListadoDeTemas1[[Tema]:[Bloque]],COLUMNS('Cronograma'!$E117:F117),FALSE),\"\")","v":""},{"$f":"IFERROR(VLOOKUP('Cronograma'!$E117,ListadoDeTemas1[[Tema]:[Bloque]],COLUMNS('Cronograma'!$E117:G117),FALSE),\"\")","v":""},{"$f":"IFERROR(VLOOKUP('Cronograma'!$E117,ListadoDeTemas1[[Tema]:[Bloque]],COLUMNS('Cronograma'!$E117:H117),FALSE),\"\")","v":""}]
[null,null,null,null,null,{"$f":"IFERROR(VLOOKUP('Cronograma'!$E118,ListadoDeTemas1[[Tema]:[Bloque]],COLUMNS('Cronograma'!$E118:F118),FALSE),\"\")","v":""},{"$f":"IFERROR(VLOOKUP('Cronograma'!$E118,ListadoDeTemas1[[Tema]:[Bloque]],COLUMNS('Cronograma'!$E118:G118),FALSE),\"\")","v":""},{"$f":"IFERROR(VLOOKUP('Cronograma'!$E118,ListadoDeTemas1[[Tema]:[Bloque]],COLUMNS('Cronograma'!$E118:H118),FALSE),\"\")","v":""}]
[null,null,null,null,null,{"$f":"IFERROR(VLOOKUP('Cronograma'!$E119,ListadoDeTemas1[[Tema]:[Bloque]],COLUMNS('Cronograma'!$E119:F119),FALSE),\"\")","v":""},{"$f":"IFERROR(VLOOKUP('Cronograma'!$E119,ListadoDeTemas1[[Tema]:[Bloque]],COLUMNS('Cronograma'!$E119:G119),FALSE),\"\")","v":""},{"$f":"IFERROR(VLOOKUP('Cronograma'!$E119,ListadoDeTemas1[[Tema]:[Bloque]],COLUMNS('Cronograma'!$E119:H119),FALSE),\"\")","v":""}]
[null,null,null,null,null,{"$f":"IFERROR(VLOOKUP('Cronograma'!$E120,ListadoDeTemas1[[Tema]:[Bloque]],COLUMNS('Cronograma'!$E120:F120),FALSE),\"\")","v":""},{"$f":"IFERROR(VLOOKUP('Cronograma'!$E120,ListadoDeTemas1[[Tema]:[Bloque]],COLUMNS('Cronograma'!$E120:G120),FALSE),\"\")","v":""},{"$f":"IFERROR(VLOOKUP('Cronograma'!$E120,ListadoDeTemas1[[Tema]:[Bloque]],COLUMNS('Cronograma'!$E120:H120),FALSE),\"\")","v":""}]
[null,null,null,null,null,{"$f":"IFERROR(VLOOKUP('Cronograma'!$E121,ListadoDeTemas1[[Tema]:[Bloque]],COLUMNS('Cronograma'!$E121:F121),FALSE),\"\")","v":""},{"$f":"IFERROR(VLOOKUP('Cronograma'!$E121,ListadoDeTemas1[[Tema]:[Bloque]],COLUMNS('Cronograma'!$E121:G121),FALSE),\"\")","v":""},{"$f":"IFERROR(VLOOKUP('Cronograma'!$E121,ListadoDeTemas1[[Tema]:[Bloque]],COLUMNS('Cronograma'!$E121:H121),FALSE),\"\")","v":""}]
[null,null,null,null,null,{"$f":"IFERROR(VLOOKUP('Cronograma'!$E122,ListadoDeTemas1[[Tema]:[Bloque]],COLUMNS('Cronograma'!$E122:F122),FALSE),\"\")","v":""},{"$f":"IFERROR(VLOOKUP('Cronograma'!$E122,ListadoDeTemas1[[Tema]:[Bloque]],COLUMNS('Cronograma'!$E122:G122),FALSE),\"\")","v":""},{"$f":"IFERROR(VLOOKUP('Cronograma'!$E122,ListadoDeTemas1[[Tema]:[Bloque]],COLUMNS('Cronograma'!$E122:H122),FALSE),\"\")","v":""}]
[null,null,null,null,null,{"$f":"IFERROR(VLOOKUP('Cronograma'!$E123,ListadoDeTemas1[[Tema]:[Bloque]],COLUMNS('Cronograma'!$E123:F123),FALSE),\"\")","v":""},{"$f":"IFERROR(VLOOKUP('Cronograma'!$E123,ListadoDeTemas1[[Tema]:[Bloque]],COLUMNS('Cronograma'!$E123:G123),FALSE),\"\")","v":""},{"$f":"IFERROR(VLOOKUP('Cronograma'!$E123,ListadoDeTemas1[[Tema]:[Bloque]],COLUMNS('Cronograma'!$E123:H123),FALSE),\"\")","v":""}]
[null,null,null,null,null,{"$f":"IFERROR(VLOOKUP('Cronograma'!$E124,ListadoDeTemas1[[Tema]:[Bloque]],COLUMNS('Cronograma'!$E124:F124),FALSE),\"\")","v":""},{"$f":"IFERROR(VLOOKUP('Cronograma'!$E124,ListadoDeTemas1[[Tema]:[Bloque]],COLUMNS('Cronograma'!$E124:G124),FALSE),\"\")","v":""},{"$f":"IFERROR(VLOOKUP('Cronograma'!$E124,ListadoDeTemas1[[Tema]:[Bloque]],COLUMNS('Cronograma'!$E124:H124),FALSE),\"\")","v":""}]
[null,null,null,null,null,{"$f":"IFERROR(VLOOKUP('Cronograma'!$E125,ListadoDeTemas1[[Tema]:[Bloque]],COLUMNS('Cronograma'!$E125:F125),FALSE),\"\")","v":""},{"$f":"IFERROR(VLOOKUP('Cronograma'!$E125,ListadoDeTemas1[[Tema]:[Bloque]],COLUMNS('Cronograma'!$E125:G125),FALSE),\"\")","v":""},{"$f":"IFERROR(VLOOKUP('Cronograma'!$E125,ListadoDeTemas1[[Tema]:[Bloque]],COLUMNS('Cronograma'!$E125:H125),FALSE),\"\")","v":""}]
[null,null,null,null,null,{"$f":"IFERROR(VLOOKUP('Cronograma'!$E126,ListadoDeTemas1[[Tema]:[Bloque]],COLUMNS('Cronograma'!$E126:F126),FALSE),\"\")","v":""},{"$f":"IFERROR(VLOOKUP('Cronograma'!$E126,ListadoDeTemas1[[Tema]:[Bloque]],COLUMNS('Cronograma'!$E126:G126),FALSE),\"\")","v":""},{"$f":"IFERROR(VLOOKUP('Cronograma'!$E126,ListadoDeTemas1[[Tema]:[Bloque]],COLUMNS('Cronograma'!$E126:H126),FALSE),\"\")","v":""}]
[null,null,null,null,null,{"$f":"IFERROR(VLOOKUP('Cronograma'!$E127,ListadoDeTemas1[[Tema]:[Bloque]],COLUMNS('Cronograma'!$E127:F127),FALSE),\"\")","v":""},{"$f":"IFERROR(VLOOKUP('Cronograma'!$E127,ListadoDeTemas1[[Tema]:[Bloque]],COLUMNS('Cronograma'!$E127:G127),FALSE),\"\")","v":""},{"$f":"IFERROR(VLOOKUP('Cronograma'!$E127,ListadoDeTemas1[[Tema]:[Bloque]],COLUMNS('Cronograma'!$E127:H127),FALSE),\"\")","v":""}]
[null,null,null,null,null,{"$f":"IFERROR(VLOOKUP('Cronograma'!$E128,ListadoDeTemas1[[Tema]:[Bloque]],COLUMNS('Cronograma'!$E128:F128),FALSE),\"\")","v":""},{"$f":"IFERROR(VLOOKUP('Cronograma'!$E128,ListadoDeTemas1[[Tema]:[Bloque]],COLUMNS('Cronograma'!$E128:G128),FALSE),\"\")","v":""},{"$f":"IFERROR(VLOOKUP('Cronograma'!$E128,ListadoDeTemas1[[Tema]:[Bloque]],COLUMNS('Cronograma'!$E128:H128),FALSE),\"\")","v":""}]
[null,null,null,null,null,{"$f":"IFERROR(VLOOKUP('Cronograma'!$E129,ListadoDeTemas1[[Tema]:[Bloque]],COLUMNS('Cronograma'!$E129:F129),FALSE),\"\")","v":""},{"$f":"IFERROR(VLOOKUP('Cronograma'!$E129,ListadoDeTemas1[[Tema]:[Bloque]],COLUMNS('Cronograma'!$E129:G129),FALSE),\"\")","v":""},{"$f":"IFERROR(VLOOKUP('Cronograma'!$E129,ListadoDeTemas1[[Tema]:[Bloque]],COLUMNS('Cronograma'!$E129:H129),FALSE),\"\")","v":""}]
[null,null,null,null,null,{"$f":"IFERROR(VLOOKUP('Cronograma'!$E130,ListadoDeTemas1[[Tema]:[Bloque]],COLUMNS('Cronograma'!$E130:F130),FALSE),\"\")","v":""},{"$f":"IFERROR(VLOOKUP('Cronograma'!$E130,ListadoDeTemas1[[Tema]:[Bloque]],COLUMNS('Cronograma'!$E130:G130),FALSE),\"\")","v":""},{"$f":"IFERROR(VLOOKUP('Cronograma'!$E130,ListadoDeTemas1[[Tema]:[Bloque]],COLUMNS('Cronograma'!$E130:H130),FALSE),\"\")","v":""}]
[null,null,null,null,null,{"$f":"IFERROR(VLOOKUP('Cronograma'!$E131,ListadoDeTemas1[[Tema]:[Bloque]],COLUMNS('Cronograma'!$E131:F131),FALSE),\"\")","v":""},{"$f":"IFERROR(VLOOKUP('Cronograma'!$E131,ListadoDeTemas1[[Tema]:[Bloque]],COLUMNS('Cronograma'!$E131:G131),FALSE),\"\")","v":""},{"$f":"IFERROR(VLOOKUP('Cronograma'!$E131,ListadoDeTemas1[[Tema]:[Bloque]],COLUMNS('Cronograma'!$E131:H131),FALSE),\"\")","v":""}]
[null,null,null,null,null,{"$f":"IFERROR(VLOOKUP('Cronograma'!$E132,ListadoDeTemas1[[Tema]:[Bloque]],COLUMNS('Cronograma'!$E132:F132),FALSE),\"\")","v":""},{"$f":"IFERROR(VLOOKUP('Cronograma'!$E132,ListadoDeTemas1[[Tema]:[Bloque]],COLUMNS('Cronograma'!$E132:G132),FALSE),\"\")","v":""},{"$f":"IFERROR(VLOOKUP('Cronograma'!$E132,ListadoDeTemas1[[Tema]:[Bloque]],COLUMNS('Cronograma'!$E132:H132),FALSE),\"\")","v":""}]
[null,null,null,null,null,{"$f":"IFERROR(VLOOKUP('Cronograma'!$E133,ListadoDeTemas1[[Tema]:[Bloque]],COLUMNS('Cronograma'!$E133:F133),FALSE),\"\")","v":""},{"$f":"IFERROR(VLOOKUP('Cronograma'!$E133,ListadoDeTemas1[[Tema]:[Bloque]],COLUMNS('Cronograma'!$E133:G133),FALSE),\"\")","v":""},{"$f":"IFERROR(VLOOKUP('Cronograma'!$E133,ListadoDeTemas1[[Tema]:[Bloque]],COLUMNS('Cronograma'!$E133:H133),FALSE),\"\")","v":""}]
[null,null,null,null,null,{"$f":"IFERROR(VLOOKUP('Cronograma'!$E134,ListadoDeTemas1[[Tema]:[Bloque]],COLUMNS('Cronograma'!$E134:F134),FALSE),\"\")","v":""},{"$f":"IFERROR(VLOOKUP('Cronograma'!$E134,ListadoDeTemas1[[Tema]:[Bloque]],COLUMNS('Cronograma'!$E134:G134),FALSE),\"\")","v":""},{"$f":"IFERROR(VLOOKUP('Cronograma'!$E134,ListadoDeTemas1[[Tema]:[Bloque]],COLUMNS('Cronograma'!$E134:H134),FALSE),\"\")","v":""}]
[null,null,null,null,null,{"$f":"IFERROR(VLOOKUP('Cronograma'!$E135,ListadoDeTemas1[[Tema]:[Bloque]],COLUMNS('Cronograma'!$E135:F135),FALSE),\"\")","v":""},{"$f":"IFERROR(VLOOKUP('Cronograma'!$E135,ListadoDeTemas1[[Tema]:[Bloque]],COLUMNS('Cronograma'!$E135:G135),FALSE),\"\")","v":""},{"$f":"IFERROR(VLOOKUP('Cronograma'!$E135,ListadoDeTemas1[[Tema]:[Bloque]],COLUMNS('Cronograma'!$E135:H135),FALSE),\"\")","v":""}]
[null,null,null,null,null,{"$f":"IFERROR(VLOOKUP('Cronograma'!$E136,ListadoDeTemas1[[Tema]:[Bloque]],COLUMNS('Cronograma'!$E136:F136),FALSE),\"\")","v":""},{"$f":"IFERROR(VLOOKUP('Cronograma'!$E136,ListadoDeTemas1[[Tema]:[Bloque]],COLUMNS('Cronograma'!$E136:G136),FALSE),\"\")","v":""},{"$f":"IFERROR(VLOOKUP('Cronograma'!$E136,ListadoDeTemas1[[Tema]:[Bloque]],COLUMNS('Cronograma'!$E136:H136),FALSE),\"\")","v":""}]
[null,null,null,null,null,{"$f":"IFERROR(VLOOKUP('Cronograma'!$E137,ListadoDeTemas1[[Tema]:[Bloque]],COLUMNS('Cronograma'!$E137:F137),FALSE),\"\")","v":""},{"$f":"IFERROR(VLOOKUP('Cronograma'!$E137,ListadoDeTemas1[[Tema]:[Bloque]],COLUMNS('Cronograma'!$E137:G137),FALSE),\"\")","v":""},{"$f":"IFERROR(VLOOKUP('Cronograma'!$E137,ListadoDeTemas1[[Tema]:[Bloque]],COLUMNS('Cronograma'!$E137:H137),FALSE),\"\")","v":""}]
[null,null,null,null,null,{"$f":"IFERROR(VLOOKUP('Cronograma'!$E138,ListadoDeTemas1[[Tema]:[Bloque]],COLUMNS('Cronograma'!$E138:F138),FALSE),\"\")","v":""},{"$f":"IFERROR(VLOOKUP('Cronograma'!$E138,ListadoDeTemas1[[Tema]:[Bloque]],COLUMNS('Cronograma'!$E138:G138),FALSE),\"\")","v":""},{"$f":"IFERROR(VLOOKUP('Cronograma'!$E138,ListadoDeTemas1[[Tema]:[Bloque]],COLUMNS('Cronograma'!$E138:H138),FALSE),\"\")","v":""}]
[null,null,null,null,null,{"$f":"IFERROR(VLOOKUP('Cronograma'!$E139,ListadoDeTemas1[[Tema]:[Bloque]],COLUMNS('Cronograma'!$E139:F139),FALSE),\"\")","v":""},{"$f":"IFERROR(VLOOKUP('Cronograma'!$E139,ListadoDeTemas1[[Tema]:[Bloque]],COLUMNS('Cronograma'!$E139:G139),FALSE),\"\")","v":""},{"$f":"IFERROR(VLOOKUP('Cronograma'!$E139,ListadoDeTemas1[[Tema]:[Bloque]],COLUMNS('Cronograma'!$E139:H139),FALSE),\"\")","v":""}]
[null,null,null,null,null,{"$f":"IFERROR(VLOOKUP('Cronograma'!$E140,ListadoDeTemas1[[Tema]:[Bloque]],COLUMNS('Cronograma'!$E140:F140),FALSE),\"\")","v":""},{"$f":"IFERROR(VLOOKUP('Cronograma'!$E140,ListadoDeTemas1[[Tema]:[Bloque]],COLUMNS('Cronograma'!$E140:G140),FALSE),\"\")","v":""},{"$f":"IFERROR(VLOOKUP('Cronograma'!$E140,ListadoDeTemas1[[Tema]:[Bloque]],COLUMNS('Cronograma'!$E140:H140),FALSE),\"\")","v":""}]
[null,null,null,null,null,{"$f":"IFERROR(VLOOKUP('Cronograma'!$E141,ListadoDeTemas1[[Tema]:[Bloque]],COLUMNS('Cronograma'!$E141:F141),FALSE),\"\")","v":""},{"$f":"IFERROR(VLOOKUP('Cronograma'!$E141,ListadoDeTemas1[[Tema]:[Bloque]],COLUMNS('Cronograma'!$E141:G141),FALSE),\"\")","v":""},{"$f":"IFERROR(VLOOKUP('Cronograma'!$E141,ListadoDeTemas1[[Tema]:[Bloque]],COLUMNS('Cronograma'!$E141:H141),FALSE),\"\")","v":""}]
[null,null,null,null,null,{"$f":"IFERROR(VLOOKUP('Cronograma'!$E142,ListadoDeTemas1[[Tema]:[Bloque]],COLUMNS('Cronograma'!$E142:F142),FALSE),\"\")","v":""},{"$f":"IFERROR(VLOOKUP('Cronograma'!$E142,ListadoDeTemas1[[Tema]:[Bloque]],COLUMNS('Cronograma'!$E142:G142),FALSE),\"\")","v":""},{"$f":"IFERROR(VLOOKUP('Cronograma'!$E142,ListadoDeTemas1[[Tema]:[Bloque]],COLUMNS('Cronograma'!$E142:H142),FALSE),\"\")","v":""}]
[null,null,null,null,null,{"$f":"IFERROR(VLOOKUP('Cronograma'!$E143,ListadoDeTemas1[[Tema]:[Bloque]],COLUMNS('Cronograma'!$E143:F143),FALSE),\"\")","v":""},{"$f":"IFERROR(VLOOKUP('Cronograma'!$E143,ListadoDeTemas1[[Tema]:[Bloque]],COLUMNS('Cronograma'!$E143:G143),FALSE),\"\")","v":""},{"$f":"IFERROR(VLOOKUP('Cronograma'!$E143,ListadoDeTemas1[[Tema]:[Bloque]],COLUMNS('Cronograma'!$E143:H143),FALSE),\"\")","v":""}]
[null,null,null,null,null,{"$f":"IFERROR(VLOOKUP('Cronograma'!$E144,ListadoDeTemas1[[Tema]:[Bloque]],COLUMNS('Cronograma'!$E144:F144),FALSE),\"\")","v":""},{"$f":"IFERROR(VLOOKUP('Cronograma'!$E144,ListadoDeTemas1[[Tema]:[Bloque]],COLUMNS('Cronograma'!$E144:G144),FALSE),\"\")","v":""},{"$f":"IFERROR(VLOOKUP('Cronograma'!$E144,ListadoDeTemas1[[Tema]:[Bloque]],COLUMNS('Cronograma'!$E144:H144),FALSE),\"\")","v":""}]
[null,null,null,null,null,{"$f":"IFERROR(VLOOKUP('Cronograma'!$E145,ListadoDeTemas1[[Tema]:[Bloque]],COLUMNS('Cronograma'!$E145:F145),FALSE),\"\")","v":""},{"$f":"IFERROR(VLOOKUP('Cronograma'!$E145,ListadoDeTemas1[[Tema]:[Bloque]],COLUMNS('Cronograma'!$E145:G145),FALSE),\"\")","v":""},{"$f":"IFERROR(VLOOKUP('Cronograma'!$E145,ListadoDeTemas1[[Tema]:[Bloque]],COLUMNS('Cronograma'!$E145:H145),FALSE),\"\")","v":""}]
[null,null,null,null,null,{"$f":"IFERROR(VLOOKUP('Cronograma'!$E146,ListadoDeTemas1[[Tema]:[Bloque]],COLUMNS('Cronograma'!$E146:F146),FALSE),\"\")","v":""},{"$f":"IFERROR(VLOOKUP('Cronograma'!$E146,ListadoDeTemas1[[Tema]:[Bloque]],COLUMNS('Cronograma'!$E146:G146),FALSE),\"\")","v":""},{"$f":"IFERROR(VLOOKUP('Cronograma'!$E146,ListadoDeTemas1[[Tema]:[Bloque]],COLUMNS('Cronograma'!$E146:H146),FALSE),\"\")","v":""}]
[null,null,null,null,null,{"$f":"IFERROR(VLOOKUP('Cronograma'!$E147,ListadoDeTemas1[[Tema]:[Bloque]],COLUMNS('Cronograma'!$E147:F147),FALSE),\"\")","v":""},{"$f":"IFERROR(VLOOKUP('Cronograma'!$E147,ListadoDeTemas1[[Tema]:[Bloque]],COLUMNS('Cronograma'!$E147:G147),FALSE),\"\")","v":""},{"$f":"IFERROR(VLOOKUP('Cronograma'!$E147,ListadoDeTemas1[[Tema]:[Bloque]],COLUMNS('Cronograma'!$E147:H147),FALSE),\"\")","v":""}]
[null,null,null,null,null,{"$f":"IFERROR(VLOOKUP('Cronograma'!$E148,ListadoDeTemas1[[Tema]:[Bloque]],COLUMNS('Cronograma'!$E148:F148),FALSE),\"\")","v":""},{"$f":"IFERROR(VLOOKUP('Cronograma'!$E148,ListadoDeTemas1[[Tema]:[Bloque]],COLUMNS('Cronograma'!$E148:G148),FALSE),\"\")","v":""},{"$f":"IFERROR(VLOOKUP('Cronograma'!$E148,ListadoDeTemas1[[Tema]:[Bloque]],COLUMNS('Cronograma'!$E148:H148),FALSE),\"\")","v":""}]
[null,null,null,null,null,{"$f":"IFERROR(VLOOKUP('Cronograma'!$E149,ListadoDeTemas1[[Tema]:[Bloque]],COLUMNS('Cronograma'!$E149:F149),FALSE),\"\")","v":""},{"$f":"IFERROR(VLOOKUP('Cronograma'!$E149,ListadoDeTemas1[[Tema]:[Bloque]],COLUMNS('Cronograma'!$E149:G149),FALSE),\"\")","v":""},{"$f":"IFERROR(VLOOKUP('Cronograma'!$E149,ListadoDeTemas1[[Tema]:[Bloque]],COLUMNS('Cronograma'!$E149:H149),FALSE),\"\")","v":""}]
[null,null,null,null,null,{"$f":"IFERROR(VLOOKUP('Cronograma'!$E150,ListadoDeTemas1[[Tema]:[Bloque]],COLUMNS('Cronograma'!$E150:F150),FALSE),\"\")","v":""},{"$f":"IFERROR(VLOOKUP('Cronograma'!$E150,ListadoDeTemas1[[Tema]:[Bloque]],COLUMNS('Cronograma'!$E150:G150),FALSE),\"\")","v":""},{"$f":"IFERROR(VLOOKUP('Cronograma'!$E150,ListadoDeTemas1[[Tema]:[Bloque]],COLUMNS('Cronograma'!$E150:H150),FALSE),\"\")","v":""}]
[null,null,null,null,null,{"$f":"IFERROR(VLOOKUP('Cronograma'!$E151,ListadoDeTemas1[[Tema]:[Bloque]],COLUMNS('Cronograma'!$E151:F151),FALSE),\"\")","v":""},{"$f":"IFERROR(VLOOKUP('Cronograma'!$E151,ListadoDeTemas1[[Tema]:[Bloque]],COLUMNS('Cronograma'!$E151:G151),FALSE),\"\")","v":""},{"$f":"IFERROR(VLOOKUP('Cronograma'!$E151,ListadoDeTemas1[[Tema]:[Bloque]],COLUMNS('Cronograma'!$E151:H151),FALSE),\"\")","v":""}]
[null,null,null,null,null,{"$f":"IFERROR(VLOOKUP('Cronograma'!$E152,ListadoDeTemas1[[Tema]:[Bloque]],COLUMNS('Cronograma'!$E152:F152),FALSE),\"\")","v":""},{"$f":"IFERROR(VLOOKUP('Cronograma'!$E152,ListadoDeTemas1[[Tema]:[Bloque]],COLUMNS('Cronograma'!$E152:G152),FALSE),\"\")","v":""},{"$f":"IFERROR(VLOOKUP('Cronograma'!$E152,ListadoDeTemas1[[Tema]:[Bloque]],COLUMNS('Cronograma'!$E152:H152),FALSE),\"\")","v":""}]
[null,null,null,null,null,{"$f":"IFERROR(VLOOKUP('Cronograma'!$E153,ListadoDeTemas1[[Tema]:[Bloque]],COLUMNS('Cronograma'!$E153:F153),FALSE),\"\")","v":""},{"$f":"IFERROR(VLOOKUP('Cronograma'!$E153,ListadoDeTemas1[[Tema]:[Bloque]],COLUMNS('Cronograma'!$E153:G153),FALSE),\"\")","v":""},{"$f":"IFERROR(VLOOKUP('Cronograma'!$E153,ListadoDeTemas1[[Tema]:[Bloque]],COLUMNS('Cronograma'!$E153:H153),FALSE),\"\")","v":""}]
[null,null,null,null,null,{"$f":"IFERROR(VLOOKUP('Cronograma'!$E154,ListadoDeTemas1[[Tema]:[Bloque]],COLUMNS('Cronograma'!$E154:F154),FALSE),\"\")","v":""},{"$f":"IFERROR(VLOOKUP('Cronograma'!$E154,ListadoDeTemas1[[Tema]:[Bloque]],COLUMNS('Cronograma'!$E154:G154),FALSE),\"\")","v":""},{"$f":"IFERROR(VLOOKUP('Cronograma'!$E154,ListadoDeTemas1[[Tema]:[Bloque]],COLUMNS('Cronograma'!$E154:H154),FALSE),\"\")","v":""}]
[null,null,null,null,null,{"$f":"IFERROR(VLOOKUP('Cronograma'!$E155,ListadoDeTemas1[[Tema]:[Bloque]],COLUMNS('Cronograma'!$E155:F155),FALSE),\"\")","v":""},{"$f":"IFERROR(VLOOKUP('Cronograma'!$E155,ListadoDeTemas1[[Tema]:[Bloque]],COLUMNS('Cronograma'!$E155:G155),FALSE),\"\")","v":""},{"$f":"IFERROR(VLOOKUP('Cronograma'!$E155,ListadoDeTemas1[[Tema]:[Bloque]],COLUMNS('Cronograma'!$E155:H155),FALSE),\"\")","v":""}]
[null,null,null,null,null,{"$f":"IFERROR(VLOOKUP('Cronograma'!$E156,ListadoDeTemas1[[Tema]:[Bloque]],COLUMNS('Cronograma'!$E156:F156),FALSE),\"\")","v":""},{"$f":"IFERROR(VLOOKUP('Cronograma'!$E156,ListadoDeTemas1[[Tema]:[Bloque]],COLUMNS('Cronograma'!$E156:G156),FALSE),\"\")","v":""},{"$f":"IFERROR(VLOOKUP('Cronograma'!$E156,ListadoDeTemas1[[Tema]:[Bloque]],COLUMNS('Cronograma'!$E156:H156),FALSE),\"\")","v":""}]
[null,null,null,null,null,{"$f":"IFERROR(VLOOKUP('Cronograma'!$E157,ListadoDeTemas1[[Tema]:[Bloque]],COLUMNS('Cronograma'!$E157:F157),FALSE),\"\")","v":""},{"$f":"IFERROR(VLOOKUP('Cronograma'!$E157,ListadoDeTemas1[[Tema]:[Bloque]],COLUMNS('Cronograma'!$E157:G157),FALSE),\"\")","v":""},{"$f":"IFERROR(VLOOKUP('Cronograma'!$E157,ListadoDeTemas1[[Tema]:[Bloque]],COLUMNS('Cronograma'!$E157:H157),FALSE),\"\")","v":""}]
[null,null,null,null,null,{"$f":"IFERROR(VLOOKUP('Cronograma'!$E158,ListadoDeTemas1[[Tema]:[Bloque]],COLUMNS('Cronograma'!$E158:F158),FALSE),\"\")","v":""},{"$f":"IFERROR(VLOOKUP('Cronograma'!$E158,ListadoDeTemas1[[Tema]:[Bloque]],COLUMNS('Cronograma'!$E158:G158),FALSE),\"\")","v":""},{"$f":"IFERROR(VLOOKUP('Cronograma'!$E158,ListadoDeTemas1[[Tema]:[Bloque]],COLUMNS('Cronograma'!$E158:H158),FALSE),\"\")","v":""}]
[null,null,null,null,null,{"$f":"IFERROR(VLOOKUP('Cronograma'!$E159,ListadoDeTemas1[[Tema]:[Bloque]],COLUMNS('Cronograma'!$E159:F159),FALSE),\"\")","v":""},{"$f":"IFERROR(VLOOKUP('Cronograma'!$E159,ListadoDeTemas1[[Tema]:[Bloque]],COLUMNS('Cronograma'!$E159:G159),FALSE),\"\")","v":""},{"$f":"IFERROR(VLOOKUP('Cronograma'!$E159,ListadoDeTemas1[[Tema]:[Bloque]],COLUMNS('Cronograma'!$E159:H159),FALSE),\"\")","v":""}]
[null,null,null,null,null,{"$f":"IFERROR(VLOOKUP('Cronograma'!$E160,ListadoDeTemas1[[Tema]:[Bloque]],COLUMNS('Cronograma'!$E160:F160),FALSE),\"\")","v":""},{"$f":"IFERROR(VLOOKUP('Cronograma'!$E160,ListadoDeTemas1[[Tema]:[Bloque]],COLUMNS('Cronograma'!$E160:G160),FALSE),\"\")","v":""},{"$f":"IFERROR(VLOOKUP('Cronograma'!$E160,ListadoDeTemas1[[Tema]:[Bloque]],COLUMNS('Cronograma'!$E160:H160),FALSE),\"\")","v":""}]
[null,null,null,null,null,{"$f":"IFERROR(VLOOKUP('Cronograma'!$E161,ListadoDeTemas1[[Tema]:[Bloque]],COLUMNS('Cronograma'!$E161:F161),FALSE),\"\")","v":""},{"$f":"IFERROR(VLOOKUP('Cronograma'!$E161,ListadoDeTemas1[[Tema]:[Bloque]],COLUMNS('Cronograma'!$E161:G161),FALSE),\"\")","v":""},{"$f":"IFERROR(VLOOKUP('Cronograma'!$E161,ListadoDeTemas1[[Tema]:[Bloque]],COLUMNS('Cronograma'!$E161:H161),FALSE),\"\")","v":""}]
[null,null,null,null,null,{"$f":"IFERROR(VLOOKUP('Cronograma'!$E162,ListadoDeTemas1[[Tema]:[Bloque]],COLUMNS('Cronograma'!$E162:F162),FALSE),\"\")","v":""},{"$f":"IFERROR(VLOOKUP('Cronograma'!$E162,ListadoDeTemas1[[Tema]:[Bloque]],COLUMNS('Cronograma'!$E162:G162),FALSE),\"\")","v":""},{"$f":"IFERROR(VLOOKUP('Cronograma'!$E162,ListadoDeTemas1[[Tema]:[Bloque]],COLUMNS('Cronograma'!$E162:H162),FALSE),\"\")","v":""}]
[null,null,null,null,null,{"$f":"IFERROR(VLOOKUP('Cronograma'!$E163,ListadoDeTemas1[[Tema]:[Bloque]],COLUMNS('Cronograma'!$E163:F163),FALSE),\"\")","v":""},{"$f":"IFERROR(VLOOKUP('Cronograma'!$E163,ListadoDeTemas1[[Tema]:[Bloque]],COLUMNS('Cronograma'!$E163:G163),FALSE),\"\")","v":""},{"$f":"IFERROR(VLOOKUP('Cronograma'!$E163,ListadoDeTemas1[[Tema]:[Bloque]],COLUMNS('Cronograma'!$E163:H163),FALSE),\"\")","v":""}]
[null,null,null,null,null,{"$f":"IFERROR(VLOOKUP('Cronograma'!$E164,ListadoDeTemas1[[Tema]:[Bloque]],COLUMNS('Cronograma'!$E164:F164),FALSE),\"\")","v":""},{"$f":"IFERROR(VLOOKUP('Cronograma'!$E164,ListadoDeTemas1[[Tema]:[Bloque]],COLUMNS('Cronograma'!$E164:G164),FALSE),\"\")","v":""},{"$f":"IFERROR(VLOOKUP('Cronograma'!$E164,ListadoDeTemas1[[Tema]:[Bloque]],COLUMNS('Cronograma'!$E164:H164),FALSE),\"\")","v":""}]
[null,null,null,null,null,{"$f":"IFERROR(VLOOKUP('Cronograma'!$E165,ListadoDeTemas1[[Tema]:[Bloque]],COLUMNS('Cronograma'!$E165:F165),FALSE),\"\")","v":""},{"$f":"IFERROR(VLOOKUP('Cronograma'!$E165,ListadoDeTemas1[[Tema]:[Bloque]],COLUMNS('Cronograma'!$E165:G165),FALSE),\"\")","v":""},{"$f":"IFERROR(VLOOKUP('Cronograma'!$E165,ListadoDeTemas1[[Tema]:[Bloque]],COLUMNS('Cronograma'!$E165:H165),FALSE),\"\")","v":""}]
[null,null,null,null,null,{"$f":"IFERROR(VLOOKUP('Cronograma'!$E166,ListadoDeTemas1[[Tema]:[Bloque]],COLUMNS('Cronograma'!$E166:F166),FALSE),\"\")","v":""},{"$f":"IFERROR(VLOOKUP('Cronograma'!$E166,ListadoDeTemas1[[Tema]:[Bloque]],COLUMNS('Cronograma'!$E166:G166),FALSE),\"\")","v":""},{"$f":"IFERROR(VLOOKUP('Cronograma'!$E166,ListadoDeTemas1[[Tema]:[Bloque]],COLUMNS('Cronograma'!$E166:H166),FALSE),\"\")","v":""}]
[null,null,null,null,null,{"$f":"IFERROR(VLOOKUP('Cronograma'!$E167,ListadoDeTemas1[[Tema]:[Bloque]],COLUMNS('Cronograma'!$E167:F167),FALSE),\"\")","v":""},{"$f":"IFERROR(VLOOKUP('Cronograma'!$E167,ListadoDeTemas1[[Tema]:[Bloque]],COLUMNS('Cronograma'!$E167:G167),FALSE),\"\")","v":""},{"$f":"IFERROR(VLOOKUP('Cronograma'!$E167,ListadoDeTemas1[[Tema]:[Bloque]],COLUMNS('Cronograma'!$E167:H167),FALSE),\"\")","v":""}]
[null,null,null,null,null,{"$f":"IFERROR(VLOOKUP('Cronograma'!$E168,ListadoDeTemas1[[Tema]:[Bloque]],COLUMNS('Cronograma'!$E168:F168),FALSE),\"\")","v":""},{"$f":"IFERROR(VLOOKUP('Cronograma'!$E168,ListadoDeTemas1[[Tema]:[Bloque]],COLUMNS('Cronograma'!$E168:G168),FALSE),\"\")","v":""},{"$f":"IFERROR(VLOOKUP('Cronograma'!$E168,ListadoDeTemas1[[Tema]:[Bloque]],COLUMNS('Cronograma'!$E168:H168),FALSE),\"\")","v":""}]
[null,null,null,null,null,{"$f":"IFERROR(VLOOKUP('Cronograma'!$E169,ListadoDeTemas1[[Tema]:[Bloque]],COLUMNS('Cronograma'!$E169:F169),FALSE),\"\")","v":""},{"$f":"IFERROR(VLOOKUP('Cronograma'!$E169,ListadoDeTemas1[[Tema]:[Bloque]],COLUMNS('Cronograma'!$E169:G169),FALSE),\"\")","v":""},{"$f":"IFERROR(VLOOKUP('Cronograma'!$E169,ListadoDeTemas1[[Tema]:[Bloque]],COLUMNS('Cronograma'!$E169:H169),FALSE),\"\")","v":""}]
[null,null,null,null,null,{"$f":"IFERROR(VLOOKUP('Cronograma'!$E170,ListadoDeTemas1[[Tema]:[Bloque]],COLUMNS('Cronograma'!$E170:F170),FALSE),\"\")","v":""},{"$f":"IFERROR(VLOOKUP('Cronograma'!$E170,ListadoDeTemas1[[Tema]:[Bloque]],COLUMNS('Cronograma'!$E170:G170),FALSE),\"\")","v":""},{"$f":"IFERROR(VLOOKUP('Cronograma'!$E170,ListadoDeTemas1[[Tema]:[Bloque]],COLUMNS('Cronograma'!$E170:H170),FALSE),\"\")","v":""}]
[null,null,null,null,null,{"$f":"IFERROR(VLOOKUP('Cronograma'!$E171,ListadoDeTemas1[[Tema]:[Bloque]],COLUMNS('Cronograma'!$E171:F171),FALSE),\"\")","v":""},{"$f":"IFERROR(VLOOKUP('Cronograma'!$E171,ListadoDeTemas1[[Tema]:[Bloque]],COLUMNS('Cronograma'!$E171:G171),FALSE),\"\")","v":""},{"$f":"IFERROR(VLOOKUP('Cronograma'!$E171,ListadoDeTemas1[[Tema]:[Bloque]],COLUMNS('Cronograma'!$E171:H171),FALSE),\"\")","v":""}]
[null,null,null,null,null,{"$f":"IFERROR(VLOOKUP('Cronograma'!$E172,ListadoDeTemas1[[Tema]:[Bloque]],COLUMNS('Cronograma'!$E172:F172),FALSE),\"\")","v":""},{"$f":"IFERROR(VLOOKUP('Cronograma'!$E172,ListadoDeTemas1[[Tema]:[Bloque]],COLUMNS('Cronograma'!$E172:G172),FALSE),\"\")","v":""},{"$f":"IFERROR(VLOOKUP('Cronograma'!$E172,ListadoDeTemas1[[Tema]:[Bloque]],COLUMNS('Cronograma'!$E172:H172),FALSE),\"\")","v":""}]
[null,null,null,null,null,{"$f":"IFERROR(VLOOKUP('Cronograma'!$E173,ListadoDeTemas1[[Tema]:[Bloque]],COLUMNS('Cronograma'!$E173:F173),FALSE),\"\")","v":""},{"$f":"IFERROR(VLOOKUP('Cronograma'!$E173,ListadoDeTemas1[[Tema]:[Bloque]],COLUMNS('Cronograma'!$E173:G173),FALSE),\"\")","v":""},{"$f":"IFERROR(VLOOKUP('Cronograma'!$E173,ListadoDeTemas1[[Tema]:[Bloque]],COLUMNS('Cronograma'!$E173:H173),FALSE),\"\")","v":""}]
[null,null,null,null,null,{"$f":"IFERROR(VLOOKUP('Cronograma'!$E174,ListadoDeTemas1[[Tema]:[Bloque]],COLUMNS('Cronograma'!$E174:F174),FALSE),\"\")","v":""},{"$f":"IFERROR(VLOOKUP('Cronograma'!$E174,ListadoDeTemas1[[Tema]:[Bloque]],COLUMNS('Cronograma'!$E174:G174),FALSE),\"\")","v":""},{"$f":"IFERROR(VLOOKUP('Cronograma'!$E174,ListadoDeTemas1[[Tema]:[Bloque]],COLUMNS('Cronograma'!$E174:H174),FALSE),\"\")","v":""}]
[null,null,null,null,null,{"$f":"IFERROR(VLOOKUP('Cronograma'!$E175,ListadoDeTemas1[[Tema]:[Bloque]],COLUMNS('Cronograma'!$E175:F175),FALSE),\"\")","v":""},{"$f":"IFERROR(VLOOKUP('Cronograma'!$E175,ListadoDeTemas1[[Tema]:[Bloque]],COLUMNS('Cronograma'!$E175:G175),FALSE),\"\")","v":""},{"$f":"IFERROR(VLOOKUP('Cronograma'!$E175,ListadoDeTemas1[[Tema]:[Bloque]],COLUMNS('Cronograma'!$E175:H175),FALSE),\"\")","v":""}]
[null,null,null,null,null,{"$f":"IFERROR(VLOOKUP('Cronograma'!$E176,ListadoDeTemas1[[Tema]:[Bloque]],COLUMNS('Cronograma'!$E176:F176),FALSE),\"\")","v":""},{"$f":"IFERROR(VLOOKUP('Cronograma'!$E176,ListadoDeTemas1[[Tema]:[Bloque]],COLUMNS('Cronograma'!$E176:G176),FALSE),\"\")","v":""},{"$f":"IFERROR(VLOOKUP('Cronograma'!$E176,ListadoDeTemas1[[Tema]:[Bloque]],COLUMNS('Cronograma'!$E176:H176),FALSE),\"\")","v":""}]
[null,null,null,null,null,{"$f":"IFERROR(VLOOKUP('Cronograma'!$E177,ListadoDeTemas1[[Tema]:[Bloque]],COLUMNS('Cronograma'!$E177:F177),FALSE),\"\")","v":""},{"$f":"IFERROR(VLOOKUP('Cronograma'!$E177,ListadoDeTemas1[[Tema]:[Bloque]],COLUMNS('Cronograma'!$E177:G177),FALSE),\"\")","v":""},{"$f":"IFERROR(VLOOKUP('Cronograma'!$E177,ListadoDeTemas1[[Tema]:[Bloque]],COLUMNS('Cronograma'!$E177:H177),FALSE),\"\")","v":""}]
[null,null,null,null,null,{"$f":"IFERROR(VLOOKUP('Cronograma'!$E178,ListadoDeTemas1[[Tema]:[Bloque]],COLUMNS('Cronograma'!$E178:F178),FALSE),\"\")","v":""},{"$f":"IFERROR(VLOOKUP('Cronograma'!$E178,ListadoDeTemas1[[Tema]:[Bloque]],COLUMNS('Cronograma'!$E178:G178),FALSE),\"\")","v":""},{"$f":"IFERROR(VLOOKUP('Cronograma'!$E178,ListadoDeTemas1[[Tema]:[Bloque]],COLUMNS('Cronograma'!$E178:H178),FALSE),\"\")","v":""}]
[null,null,null,null,null,{"$f":"IFERROR(VLOOKUP('Cronograma'!$E179,ListadoDeTemas1[[Tema]:[Bloque]],COLUMNS('Cronograma'!$E179:F179),FALSE),\"\")","v":""}]

{"sheet":"Horario de estudio","index":14,"n_rows":50,"n_cols":13,"rows_kept":50,"cut":false,"hidden":false,"merged":[[1,11,1,12],[10,10,10,13]]}
[]
[null,null,"Hora","Sábado","Domingo","Lunes","Martes","Miércoles","Jueves","Viernes",null,"Estadísticas del horario"]
[null,null,"00:00:00","Dormir","Dormir","Dormir","Dormir","Dormir","Dormir","Dormir",null,"Horas dormir/día",{"$f":"COUNTIF(Horario[[Sábado]:[Viernes]],\"Dormir\")*0.5/7","v":7.8571428571428568}]
[null,null,"00:30:00","Dormir","Dormir","Dormir","Dormir","Dormir","Dormir","Dormir",null,"Horas descanso/día",{"$f":"COUNTIF(Horario[[Sábado]:[Viernes]],\"Descanso\")*0.5/7","v":4.2142857142857144}]
[null,null,"01:00:00","Dormir","Dormir","Dormir","Dormir","Dormir","Dormir","Dormir",null,"Horas ejercicio/día",{"$f":"COUNTIF(Horario[[Sábado]:[Viernes]],\"Ejercicio\")*0.5/7","v":1.2857142857142858}]
[null,null,"01:30:00","Dormir","Dormir","Dormir","Dormir","Dormir","Dormir","Dormir",null,"Horas comer/día",{"$f":"(COUNTIF(Horario[[Sábado]:[Viernes]],\"Desayuno\")+COUNTIF(Horario[[Sábado]:[Viernes]],\"Comida\")+COUNTIF(Horario[[Sábado]:[Viernes]],\"Cena\"))*0.5/7","v":2.9285714285714284}]
[null,null,"02:00:00","Dormir","Dormir","Dormir","Dormir","Dormir","Dormir","Dormir",null,"Horas estudiar/día",{"$f":"COUNTIF(Horario[[Sábado]:[Viernes]],\"Estudiar\")*0.5/7","v":7.4285714285714288}]
[null,null,"02:30:00","Dormir","Dormir","Dormir","Dormir","Dormir","Dormir","Dormir",null,"Horas idioma/día",{"$f":"COUNTIF(Horario[[Sábado]:[Viernes]],\"Idioma\")*0.5/7","v":0.2857142857142857}]
[null,null,"03:00:00","Dormir","Dormir","Dormir","Dormir","Dormir","Dormir","Dormir",null,"TOTAL",{"$f":"SUM(M3:M8)","v":24}]
[null,null,"03:30:00","Dormir","Dormir","Dormir","Dormir","Dormir","Dormir","Dormir"]
[null,null,"04:00:00","Dormir","Dormir","Dormir","Dormir","Dormir","Dormir","Dormir","Estadísticas del horario sin tener en cuenta el día de descanso"]
[null,null,"04:30:00","Dormir","Dormir","Dormir","Dormir","Dormir","Dormir","Dormir",null,"Horas dormir/día",{"$f":"COUNTIF(Horario[[Domingo]:[Viernes]],\"Dormir\")*0.5/6","v":7.5}]
[null,null,"05:00:00","Dormir","Dormir","Dormir","Dormir","Dormir","Dormir","Dormir",null,"Horas descanso/día",{"$f":"COUNTIF(Horario[[Domingo]:[Viernes]],\"Descanso\")*0.5/6","v":3}]
[null,null,"05:30:00","Dormir","Dormir","Dormir","Dormir","Dormir","Dormir","Dormir",null,"Horas ejercicio/día",{"$f":"COUNTIF(Horario[[Domingo]:[Viernes]],\"Ejercicio\")*0.5/6","v":1.5}]
[null,null,"06:00:00","Dormir","Dormir","Dormir","Dormir","Dormir","Dormir","Dormir",null,"Horas comer/día",{"$f":"(COUNTIF(Horario[[Domingo]:[Viernes]],\"Desayuno\")+COUNTIF(Horario[[Domingo]:[Viernes]],\"Comida\")+COUNTIF(Horario[[Domingo]:[Viernes]],\"Cena\"))*0.5/6","v":3}]
[null,null,"06:30:00","Dormir","Dormir","Dormir","Dormir","Dormir","Dormir","Dormir",null,"Horas estudiar/día",{"$f":"COUNTIF(Horario[[Domingo]:[Viernes]],\"Estudiar\")*0.5/6","v":8.6666666666666661}]
[null,null,"07:00:00","Dormir","Dormir","Dormir","Dormir","Dormir","Dormir","Dormir",null,"Horas idioma/día",{"$f":"COUNTIF(Horario[[Domingo]:[Viernes]],\"Idioma\")*0.5/6","v":0.33333333333333331}]
[null,null,"07:30:00","Dormir","Desayuno","Desayuno","Desayuno","Desayuno","Desayuno","Desayuno",null,"TOTAL",{"$f":"SUM(M12:M17)","v":23.999999999999996}]
[null,null,"08:00:00","Dormir","Desayuno","Desayuno","Desayuno","Desayuno","Desayuno","Desayuno"]
[null,null,"08:30:00","Dormir","Estudiar","Estudiar","Estudiar","Estudiar","Estudiar","Estudiar"]
[null,null,"09:00:00","Dormir","Estudiar","Estudiar","Estudiar","Estudiar","Estudiar","Estudiar"]
[null,null,"09:30:00","Dormir","Estudiar","Estudiar","Estudiar","Estudiar","Estudiar","Estudiar"]
[null,null,"10:00:00","Desayuno","Estudiar","Estudiar","Estudiar","Estudiar","Estudiar","Estudiar"]
[null,null,"10:30:00","Descanso","Estudiar","Estudiar","Estudiar","Estudiar","Estudiar","Estudiar"]
[null,null,"11:00:00","Descanso","Descanso","Descanso","Descanso","Descanso","Descanso","Descanso"]
[null,null,"11:30:00","Descanso","Estudiar","Estudiar","Estudiar","Estudiar","Estudiar","Estudiar"]
[null,null,"12:00:00","Descanso","Estudiar","Estudiar","Estudiar","Estudiar","Estudiar","Estudiar"]
[null,null,"12:30:00","Descanso","Estudiar","Estudiar","Estudiar","Estudiar","Estudiar","Estudiar"]
[null,null,"13:00:00","Descanso","Estudiar","Estudiar","Estudiar","Estudiar","Estudiar","Estudiar"]
[null,null,"13:30:00","Descanso","Estudiar","Estudiar","Estudiar","Idioma","Estudiar","Estudiar"]
[null,null,"14:00:00","Descanso","Estudiar","Estudiar","Estudiar","Idioma","Estudiar","Estudiar"]
[null,null,"14:30:00","Comida","Comida","Comida","Comida","Comida","Comida","Comida"]
[null,null,"15:00:00","Comida","Comida","Comida","Comida","Comida","Comida","Comida"]
[null,null,"15:30:00","Comida","Comida","Comida","Comida","Comida","Comida","Comida"]
[null,null,"16:00:00","Descanso","Idioma","Estudiar","Estudiar","Estudiar","Estudiar","Estudiar"]
[null,null,"16:30:00","Descanso","Idioma","Estudiar","Estudiar","Estudiar","Estudiar","Estudiar"]
[null,null,"17:00:00","Descanso","Estudiar","Estudiar","Estudiar","Estudiar","Estudiar","Estudiar"]
[null,null,"17:30:00","Descanso","Estudiar","Estudiar","Estudiar","Estudiar","Estudiar","Estudiar"]
[null,null,"18:00:00","Descanso","Descanso","Descanso","Descanso","Descanso","Descanso","Descanso"]
[null,null,"18:30:00","Descanso","Estudiar","Estudiar","Estudiar","Estudiar","Estudiar","Estudiar"]
[null,null,"19:00:00","Descanso","Estudiar","Estudiar","Estudiar","Estudiar","Estudiar","Estudiar"]
[null,null,"19:30:00","Descanso","Estudiar","Estudiar","Estudiar","Estudiar","Estudiar","Estudiar"]
[null,null,"20:00:00","Descanso","Ejercicio","Ejercicio","Ejercicio","Ejercicio","Ejercicio","Ejercicio"]
[null,null,"20:30:00","Descanso","Ejercicio","Ejercicio","Ejercicio","Ejercicio","Ejercicio","Ejercicio"]
[null,null,"21:00:00","Descanso","Ejercicio","Ejercicio","Ejercicio","Ejercicio","Ejercicio","Ejercicio"]
[null,null,"21:30:00","Cena","Cena","Cena","Cena","Cena","Cena","Cena"]
[null,null,"22:00:00","Descanso","Descanso","Descanso","Descanso","Descanso","Descanso","Descanso"]
[null,null,"22:30:00","Descanso","Descanso","Descanso","Descanso","Descanso","Descanso","Descanso"]
[null,null,"23:00:00","Descanso","Descanso","Descanso","Descanso","Descanso","Descanso","Descanso"]
[null,null,"23:30:00","Descanso","Descanso","Descanso","Descanso","Descanso","Descanso","Descanso"]